program: Orca
programVersion: 5.0.2
elementType: Cl Cl O O O N C C C C C C C C C C C C C C C C C C C C C C H H H H H H H H H H H H H H H H H H H
charge: 0
multiplicity: 1
keywords: wb97x-d3
keywords: def2-TZVPP
keywords: def2/J RIJCOSX
keywords: DEFGRID2
keywords: scfconv7
keywords: smallprint printgap noloewdin
keywords: NOSOSCF
formula: C22H19Cl2NO3
InChI: InChI=1/C22H19Cl2NO3/c1-22(2)17(12-19(23)24)20(22)21(26)28-18(13-25)14-7-6-10-16(11-14)27-15-8-4-3-5-9-15/h3-12,17-18,20H,1-2H3
47 atoms
Cl -4.423422 3.877259 -0.952413
Cl -3.443535 6.516227 -0.323494
O  1.04471 1.099067 0.840849
O  -0.791644 0.317403 -0.164559
O  1.474803 -4.719163 -0.508089
N  3.059538 0.12944 3.269828
C  -0.205785 2.812955 -2.024307
C  -1.376476 3.095236 -1.127991
C  -0.081997 2.582622 -0.529394
C  -0.322656 1.648924 -2.976828
C  0.619398 3.947342 -2.579673
C  -1.794003 4.463905 -0.802855
C  -0.02593 1.226279 0.036191
C  -3.048827 4.883129 -0.705323
C  1.274407 -0.190383 1.387697
C  1.800015 -1.175477 0.367465
C  2.274766 0.010182 2.438019
C  1.359893 -2.489313 0.42016
C  2.731519 -0.77195 -0.58105
C  1.882969 -3.415539 -0.473894
C  3.21879 -1.702679 -1.485267
C  2.809563 -3.026062 -1.430413
C  1.142853 -5.385335 0.64661
C  1.860662 -5.233294 1.826478
C  0.087619 -6.282813 0.567645
C  1.498598 -5.981622 2.937711
C  -0.252863 -7.03476 1.683155
C  0.444519 -6.883217 2.873564
H  -2.171792 2.360728 -1.186481
H  0.529559 3.310994 -0.009375
H  -0.698199 2.007037 -3.93658
H  -1.003314 0.874006 -2.632355
H  0.652718 1.192532 -3.154244
H  0.141539 4.367059 -3.466489
H  1.603099 3.580034 -2.87562
H  0.774254 4.755206 -1.866311
H  -1.019872 5.199755 -0.621208
H  0.373422 -0.584653 1.869469
H  0.617384 -2.778392 1.153951
H  3.077752 0.252512 -0.621257
H  3.938364 -1.399719 -2.233717
H  3.202416 -3.753859 -2.128683
H  2.694929 -4.546157 1.88768
H  -0.45686 -6.396367 -0.361144
H  2.053931 -5.860434 3.858407
H  -1.073149 -7.737533 1.61881
H  0.171763 -7.465561 3.743316
elementType: Cl O N C H
totalener: -2050.67286422 hartree
nucrepener: 2675.02834218 hartree
electener: -4725.70120640 hartree
oneelecener: -8125.39006338 hartree
twoeener: 3399.68885698 hartree
cpcmener: -0.03771376 hartree
kineticenergy: 2044.45442740 hartree
xcener: -151.862303330489 hartree
chargesum: 0.0000000
charge: -0.057044 -0.061347 -0.283233 -0.460470 -0.335651 -0.100476 0.091783 0.030014 -0.069626 -0.265295 -0.265681 -0.199987 0.390514 0.038239 0.415359 0.020505 -0.220231 -0.203319 -0.230585 0.285868 -0.124924 -0.228784 0.305153 -0.208784 -0.261093 -0.140585 -0.119023 -0.194053 0.080055 0.100940 0.101604 0.093957 0.097940 0.101234 0.099113 0.093612 0.133928 0.145261 0.148104 0.149934 0.161728 0.151031 0.159405 0.148716 0.162860 0.161710 0.161626
qa: -0.0570 -0.0613 -0.2832 -0.4605 -0.3357 -0.1005 0.0918 0.0300 -0.0696 -0.2653 -0.2657 -0.2000 0.3905 0.0382 0.4154 0.0205 -0.2202 -0.2033 -0.2306 0.2859 -0.1249 -0.2288 0.3052 -0.2088 -0.2611 -0.1406 -0.1190 -0.1941 0.0801 0.1009 0.1016 0.0940 0.0979 0.1012 0.0991 0.0936 0.1339 0.1453 0.1481 0.1499 0.1617 0.1510 0.1594 0.1487 0.1629 0.1617 0.1616
va: 1.2687 1.2434 2.1234 2.0485 2.0741 3.1106 3.7390 3.8868 3.8319 3.9040 3.9066 3.8960 4.1898 4.2092 3.7061 3.6040 4.0830 3.9821 3.9497 3.7153 3.9060 4.0027 3.6634 3.9146 4.0114 3.8815 3.8731 3.9058 1.0472 1.0328 1.0008 1.0174 1.0011 1.0010 1.0011 1.0052 1.0171 1.0182 1.0047 1.0120 0.9882 1.0043 0.9964 1.0078 0.9890 0.9878 0.9895
dispcorr: -0.023414207 hartree
energy: -2050.696278429406
dipole: 23.32477 -22.80758 0.51720 -26.04633 26.14786 0.10153 -8.47173 7.22781 -1.24392
magnitude: 1.35098 au
magnitude: 3.43391 debye
