program: Orca
programVersion: 5.0.2
elementType: Cl Cl O O O N C C C C C C C C C C C C C C C C C C C C C C H H H H H H H H H H H H H H H H H H H
charge: 0
multiplicity: 1
keywords: wb97x-d3
keywords: def2-TZVPP
keywords: def2/J RIJCOSX
keywords: DEFGRID2
keywords: scfconv7
keywords: smallprint printgap noloewdin
keywords: NOSOSCF
formula: C22H19Cl2NO3
InChI: InChI=1/C22H19Cl2NO3/c1-22(2)17(12-19(23)24)20(22)21(26)28-18(13-25)14-7-6-10-16(11-14)27-15-8-4-3-5-9-15/h3-12,17-18,20H,1-2H3
47 atoms
Cl -2.466215 0.107751 -1.191731
Cl -4.219913 0.153498 1.094242
O  1.823723 1.800001 -0.330651
O  2.507426 2.111796 1.770575
O  0.565216 -2.963956 0.943769
N  3.05325 0.731363 -3.193055
C  -0.461033 3.776108 0.458857
C  -0.884032 2.346954 0.299076
C  0.280017 2.690116 1.214027
C  0.164232 4.458807 -0.73191
C  -1.279115 4.713138 1.312719
C  -2.098661 1.77815 0.892693
C  1.640798 2.200478 0.935945
C  -2.821891 0.814318 0.334887
C  2.990234 1.038623 -0.598659
C  2.94553 -0.322083 0.062809
C  3.01412 0.881185 -2.053469
C  1.742269 -1.015865 0.130633
C  4.108229 -0.857246 0.595198
C  1.718496 -2.257739 0.749197
C  4.06837 -2.106291 1.198485
C  2.879014 -2.810789 1.277036
C  -0.430653 -3.007629 -0.001083
C  -0.174471 -3.02756 -1.365773
C  -1.728702 -3.11712 0.47964
C  -1.238087 -3.16199 -2.24832
C  -2.777495 -3.266903 -0.41426
C  -2.538367 -3.289631 -1.781113
H  -0.595883 1.911381 -0.649179
H  0.073069 2.676661 2.278131
H  0.677038 3.774175 -1.403797
H  0.878852 5.217802 -0.409545
H  -0.612167 4.961778 -1.310635
H  -1.660016 4.243456 2.218603
H  -2.130792 5.094151 0.746976
H  -0.67383 5.568085 1.617677
H  -2.41824 2.140964 1.862076
H  3.899306 1.574984 -0.307071
H  0.833125 -0.591734 -0.279465
H  5.035505 -0.301127 0.546121
H  4.96959 -2.532358 1.617973
H  2.842635 -3.780786 1.755897
H  0.835995 -2.95049 -1.746326
H  -1.911133 -3.099101 1.546651
H  -1.039917 -3.176877 -3.312119
H  -3.787191 -3.358184 -0.036284
H  -3.358918 -3.399787 -2.477288
elementType: Cl O N C H
totalener: -2050.66831355 hartree
nucrepener: 2953.02305314 hartree
electener: -5003.69136670 hartree
oneelecener: -8681.74702694 hartree
twoeener: 3678.05566025 hartree
cpcmener: -0.03714435 hartree
kineticenergy: 2044.46587110 hartree
xcener: -151.867731645548 hartree
chargesum: 0.0000000
charge: -0.057642 -0.065873 -0.283884 -0.454140 -0.335656 -0.099307 0.086596 0.038149 -0.065340 -0.258336 -0.273698 -0.220536 0.393242 0.067922 0.388283 0.016214 -0.221990 -0.193224 -0.217487 0.291950 -0.103790 -0.249648 0.342178 -0.217951 -0.282312 -0.134945 -0.118491 -0.196914 0.085730 0.101906 0.094143 0.099882 0.097688 0.093865 0.101859 0.099312 0.134237 0.151082 0.131793 0.148592 0.161815 0.150211 0.155986 0.145793 0.161169 0.154398 0.157168
qa: -0.0576 -0.0659 -0.2839 -0.4541 -0.3357 -0.0993 0.0866 0.0381 -0.0653 -0.2583 -0.2737 -0.2205 0.3932 0.0679 0.3883 0.0162 -0.2220 -0.1932 -0.2175 0.2920 -0.1038 -0.2496 0.3422 -0.2180 -0.2823 -0.1349 -0.1185 -0.1969 0.0857 0.1019 0.0941 0.0999 0.0977 0.0939 0.1019 0.0993 0.1342 0.1511 0.1318 0.1486 0.1618 0.1502 0.1560 0.1458 0.1612 0.1544 0.1572
va: 1.2753 1.2399 2.1130 2.0485 2.0775 3.1044 3.7767 3.8098 3.8289 3.9047 3.9136 3.9241 4.1736 4.1785 3.7404 3.6179 4.0749 3.9767 3.9832 3.7076 3.8790 4.0047 3.6122 3.9093 3.9637 3.8522 3.8312 3.8711 1.0426 1.0271 1.0112 1.0007 0.9999 1.0047 1.0003 1.0011 1.0188 1.0124 1.0121 1.0013 0.9879 1.0051 0.9980 1.0096 0.9888 0.9934 0.9908
dispcorr: -0.028893237 hartree
energy: -2050.697206790780
dipole: 10.97134 -11.26824 -0.29690 12.55026 -11.45835 1.09190 2.22353 -1.29357 0.92996
magnitude: 1.46466 au
magnitude: 3.72287 debye
