program: Orca
programVersion: 5.0.2
elementType: Cl Cl O O O N C C C C C C C C C C C C C C C C C C C C C C H H H H H H H H H H H H H H H H H H H
charge: 0
multiplicity: 1
keywords: wb97x-d3
keywords: def2-TZVPP
keywords: def2/J RIJCOSX
keywords: DEFGRID2
keywords: scfconv7
keywords: smallprint printgap noloewdin
keywords: NOSOSCF
formula: C22H19Cl2NO3
InChI: InChI=1/C22H19Cl2NO3/c1-22(2)17(12-19(23)24)20(22)21(26)28-18(13-25)14-7-6-10-16(11-14)27-15-8-4-3-5-9-15/h3-12,17-18,20H,1-2H3
47 atoms
Cl -3.289368 1.100943 2.143483
Cl -2.870818 3.393307 3.844824
O  2.224535 1.580143 -0.514523
O  0.412641 0.518537 -1.273308
O  1.405062 -4.149898 -0.001102
N  3.003332 -0.085128 -3.382139
C  -0.922842 3.342751 -1.004437
C  -1.249775 2.525749 0.207569
C  0.199448 2.671313 -0.23744
C  -1.368861 2.81676 -2.346519
C  -0.948054 4.850344 -0.929666
C  -1.636887 3.131845 1.485576
C  0.900749 1.480572 -0.735119
C  -2.482556 2.605699 2.362321
C  3.032311 0.449567 -0.822589
C  2.72208 -0.735087 0.064605
C  2.977091 0.144039 -2.255431
C  2.207178 -1.920906 -0.435258
C  2.94955 -0.588046 1.429438
C  1.893734 -2.950487 0.44239
C  2.64553 -1.630164 2.290063
C  2.106928 -2.812821 1.804888
C  0.470011 -4.177943 -1.007429
C  -0.551077 -3.239281 -1.101044
C  0.55362 -5.228835 -1.909662
C  -1.486375 -3.359842 -2.119311
C  -0.396502 -5.342504 -2.914677
C  -1.415035 -4.40628 -3.02955
H  -1.688281 1.558043 -0.007728
H  0.813733 3.340596 0.353396
H  -0.663068 3.101897 -3.12827
H  -2.334754 3.256541 -2.599432
H  -1.487704 1.73658 -2.371451
H  -1.971617 5.216961 -1.021703
H  -0.369282 5.272933 -1.752138
H  -0.530513 5.242333 -0.00367
H  -1.19006 4.082536 1.750868
H  4.051414 0.789642 -0.623133
H  2.040956 -2.049351 -1.497771
H  3.361645 0.333796 1.81966
H  2.819728 -1.520037 3.351902
H  1.858225 -3.624032 2.476851
H  -0.626552 -2.422647 -0.394004
H  1.353458 -5.953286 -1.822393
H  -2.280028 -2.628146 -2.194829
H  -0.330319 -6.163958 -3.615878
H  -2.149293 -4.492736 -3.819107
elementType: Cl O N C H
totalener: -2050.67151745 hartree
nucrepener: 2805.36333110 hartree
electener: -4856.03484855 hartree
oneelecener: -8387.16734925 hartree
twoeener: 3531.13250070 hartree
cpcmener: -0.03879127 hartree
kineticenergy: 2044.45763371 hartree
xcener: -151.864835776201 hartree
chargesum: -0.0000000
charge: -0.056839 -0.061216 -0.287481 -0.472132 -0.340038 -0.091995 0.091943 0.021161 -0.077833 -0.269639 -0.268779 -0.200422 0.440464 0.041197 0.488572 -0.018535 -0.247275 -0.176044 -0.254798 0.259980 -0.113438 -0.234283 0.290460 -0.189089 -0.254881 -0.147166 -0.122889 -0.190645 0.086852 0.097052 0.102044 0.099055 0.094877 0.102068 0.099212 0.093606 0.132704 0.148023 0.140424 0.146693 0.162445 0.150590 0.152891 0.148109 0.162487 0.161255 0.161255
qa: -0.0568 -0.0612 -0.2875 -0.4721 -0.3400 -0.0920 0.0919 0.0212 -0.0778 -0.2696 -0.2688 -0.2004 0.4405 0.0412 0.4886 -0.0185 -0.2473 -0.1760 -0.2548 0.2600 -0.1134 -0.2343 0.2905 -0.1891 -0.2549 -0.1472 -0.1229 -0.1906 0.0869 0.0971 0.1020 0.0991 0.0949 0.1021 0.0992 0.0936 0.1327 0.1480 0.1404 0.1467 0.1624 0.1506 0.1529 0.1481 0.1625 0.1613 0.1613
va: 1.2684 1.2437 2.1374 2.0286 2.0699 3.1028 3.7372 3.8857 3.8636 3.9042 3.9087 3.8989 4.1004 4.2107 3.8211 3.6701 4.0855 3.8820 3.9873 3.7859 3.8838 4.0185 3.6815 3.8886 4.0048 3.8895 3.8781 3.9032 1.0390 1.0337 0.9992 1.0000 1.0182 1.0003 1.0008 1.0058 1.0185 0.9916 1.0156 1.0069 0.9876 1.0040 1.0044 1.0075 0.9895 0.9879 0.9893
dispcorr: -0.024454380 hartree
energy: -2050.695971829861
dipole: 8.55924 -7.99472 0.56452 -0.63605 2.58107 1.94502 -21.95007 23.27841 1.32834
magnitude: 2.42204 au
magnitude: 6.15633 debye
