program: Orca
programVersion: 5.0.2
elementType: Cl Cl O O O N C C C C C C C C C C C C C C C C C C C C C C H H H H H H H H H H H H H H H H H H H
charge: 0
multiplicity: 1
keywords: wb97x-d3
keywords: def2-TZVPP
keywords: def2/J RIJCOSX
keywords: DEFGRID2
keywords: scfconv7
keywords: smallprint printgap noloewdin
keywords: NOSOSCF
formula: C22H19Cl2NO3
InChI: InChI=1/C22H19Cl2NO3/c1-22(2)17(12-19(23)24)20(22)21(26)28-18(13-25)14-7-6-10-16(11-14)27-15-8-4-3-5-9-15/h3-12,17-18,20H,1-2H3
47 atoms
Cl -4.103978 4.052854 0.445193
Cl -2.860361 6.597261 -0.097737
O  1.382674 1.027483 0.259931
O  -0.68409 0.18022 0.132717
O  1.33892 -4.73059 -0.563398
N  3.795076 0.732752 2.495774
C  -0.973468 2.231606 -2.220005
C  -1.56919 2.832569 -0.981958
C  -0.161046 2.261897 -0.940028
C  -1.572804 0.94453 -2.730825
C  -0.473309 3.125567 -3.328934
C  -1.729672 4.281752 -0.818662
C  0.100599 1.052688 -0.144893
C  -2.758295 4.883039 -0.234539
C  1.800387 -0.098467 1.02597
C  2.231053 -1.246723 0.146671
C  2.917927 0.382465 1.839692
C  1.561187 -2.458363 0.237196
C  3.280273 -1.077548 -0.750227
C  1.968142 -3.518161 -0.565103
C  3.661302 -2.139012 -1.554414
C  3.016214 -3.36286 -1.460972
C  0.763547 -5.218355 0.585808
C  1.431848 -5.207651 1.803767
C  -0.492498 -5.793394 0.467274
C  0.822374 -5.778761 2.911579
C  -1.08387 -6.372944 1.581126
C  -0.433121 -6.363944 2.806996
H  -2.319997 2.216399 -0.500793
H  0.644439 2.986925 -0.931182
H  -2.060056 0.356838 -1.956663
H  -0.811164 0.322626 -3.204922
H  -2.326447 1.176474 -3.4857
H  0.217431 2.573772 -3.968101
H  0.05299 4.006819 -2.965803
H  -1.304759 3.46122 -3.950764
H  -0.944376 4.923932 -1.199644
H  1.016467 -0.420431 1.717964
H  0.735442 -2.567516 0.929434
H  3.802556 -0.131352 -0.819594
H  4.477607 -2.020069 -2.253857
H  3.321318 -4.194845 -2.082639
H  2.417704 -4.768514 1.892509
H  -0.998237 -5.793826 -0.489883
H  1.341119 -5.772754 3.861249
H  -2.062352 -6.825367 1.487885
H  -0.898675 -6.811433 3.674887
elementType: Cl O N C H
totalener: -2050.67308218 hartree
nucrepener: 2677.73065247 hartree
electener: -4728.40373465 hartree
oneelecener: -8130.88063301 hartree
twoeener: 3402.47689836 hartree
cpcmener: -0.03606402 hartree
kineticenergy: 2044.44782670 hartree
xcener: -151.859693878201 hartree
chargesum: -0.0000000
charge: -0.056781 -0.061144 -0.284124 -0.471863 -0.336519 -0.102089 0.090796 0.029367 -0.084931 -0.271041 -0.266869 -0.197409 0.420452 0.038357 0.422497 -0.002599 -0.219591 -0.168178 -0.225449 0.272674 -0.130111 -0.230312 0.281094 -0.192175 -0.248685 -0.143426 -0.124941 -0.186448 0.082471 0.099413 0.094135 0.102762 0.099429 0.099160 0.093823 0.101593 0.133088 0.137249 0.146573 0.150391 0.162942 0.151282 0.160341 0.149438 0.162805 0.161666 0.160888
qa: -0.0568 -0.0611 -0.2841 -0.4719 -0.3365 -0.1021 0.0908 0.0294 -0.0849 -0.2710 -0.2669 -0.1974 0.4205 0.0384 0.4225 -0.0026 -0.2196 -0.1682 -0.2254 0.2727 -0.1301 -0.2303 0.2811 -0.1922 -0.2487 -0.1434 -0.1249 -0.1864 0.0825 0.0994 0.0941 0.1028 0.0994 0.0992 0.0938 0.1016 0.1331 0.1372 0.1466 0.1504 0.1629 0.1513 0.1603 0.1494 0.1628 0.1617 0.1609
va: 1.2689 1.2438 2.1343 2.0380 2.0694 3.1092 3.7259 3.8807 3.8600 3.9040 3.9106 3.8959 4.1542 4.2097 3.7125 3.6275 4.0797 3.9215 3.9808 3.7360 3.9151 4.0120 3.6794 3.9179 4.0106 3.8822 3.8767 3.8991 1.0451 1.0331 1.0184 0.9988 0.9999 1.0010 1.0055 1.0006 1.0175 1.0198 1.0120 1.0077 0.9884 1.0046 0.9953 1.0067 0.9889 0.9880 0.9895
dispcorr: -0.022811447 hartree
energy: -2050.695893623450
dipole: 13.76174 -13.81323 -0.05149 -30.33967 29.81564 -0.52403 -13.90272 12.28346 -1.61927
magnitude: 1.70273 au
magnitude: 4.32799 debye
