program: Gaussian 09
title: 000072552
version: EM64L-G09RevD.01
frameworkgroup: C1[X(C14H12N2O2S2)]
method: RPBEPBE
basis: SDD
operation: Freq
keyword: #p
keyword: freq=noraman
keyword: PBEPBE/SDD
title: #p freq=noraman PBEPBE/SDD
converged: YES YES NO NO
title: Mulliken charges:
elementType: S S O O N N C C C C C C C C C C C C C C H H H H H H H H H H H H
charge: 0.025342 0.025482 -0.278582 -0.278537 -0.622959 -0.622843 -0.370672 -0.371294 0.314992 0.315171 -0.165489 -0.165538 -0.329884 -0.329865 -0.225211 -0.225020 -0.223195 -0.223127 0.158916 0.158338 0.264478 0.264639 0.297704 0.297662 0.242154 0.242179 0.242018 0.242075 0.334576 0.336021 0.334414 0.336054
chargesum: 0.00000
title: Mulliken charges with hydrogens summed into heavy atoms:
elementType: S S O O N N C C C C C C C C C C C C C C
charge: 0.025342 0.025482 -0.278582 -0.278537 0.047638 0.047625 -0.370672 -0.371294 0.314992 0.315171 0.098990 0.099102 -0.032180 -0.032202 0.016807 0.017055 0.018959 0.019052 0.158916 0.158338
polarizability: 3.18853289e+02 -5.51800086e-02 2.09232311e+02 3.98404390e+01 -2.26672092e-02 1.42981377e+02
1716.lowfreq: -13.5578 -11.9905 -7.9048 -6.9654 0.0014 0.0022 0.0024 12.1289 26.9193
frequency: -11.4998 10.7747 26.9131 47.5775 64.0382 80.0104 81.6207 114.2285 127.8724 210.0266 228.5095 239.3537 257.7894 285.8053 290.0925 337.6894 347.2474 351.0586 423.7129 425.1197 426.9972 429.6163 492.8866 494.2340 495.7942 499.6873 591.3398 592.8539 600.3159 600.4361 628.5735 652.2316 656.1488 662.0566 690.3310 692.7714 750.0127 750.5928 758.5972 761.1678 789.8431 790.3390 905.0702 905.7994 984.2913 984.5723 1007.6045 1010.8763 1019.8606 1019.9746 1036.7049 1036.9460 1079.1055 1080.1866 1103.4853 1103.8157 1138.1047 1139.4343 1172.1340 1172.2276 1252.0504 1252.9756 1351.1784 1353.2007 1367.7116 1368.6182 1412.0096 1412.0946 1447.0690 1447.2736 1550.1298 1552.9275 1566.1138 1568.9977 1591.2303 1591.3849 1622.6881 1624.4326 3137.1837 3137.3526 3149.0216 3149.1469 3159.4015 3159.5138 3171.7780 3171.9400 3424.0379 3427.2668 3625.6445 3626.3149
redmass: 6.7999 7.4026 9.9045 5.5474 6.4912 5.7391 5.7839 4.5261 5.3412 5.4269 7.2754 10.9411 7.6713 5.5127 5.7338 7.4481 7.9065 13.2491 4.3542 4.2529 4.9266 4.7840 3.7505 4.4825 4.6558 3.8101 3.0496 4.1270 1.4604 1.5201 1.1644 2.6345 5.8181 1.4652 2.8790 2.9026 4.9857 4.7765 2.6470 2.4833 1.6901 1.7144 1.3767 1.3793 1.3714 1.3696 7.6769 7.5026 1.3573 1.3562 2.9020 2.8797 1.8788 1.8765 2.3196 2.2911 1.7517 1.7460 1.0637 1.0635 1.4235 1.4233 3.7389 4.0430 7.0963 6.0829 2.1331 2.1325 2.4911 2.4923 4.1197 5.1350 2.6648 2.3613 4.3221 4.0816 2.2938 2.3435 1.0860 1.0860 1.0898 1.0898 1.0944 1.0944 1.1010 1.1011 1.0530 1.0525 1.0979 1.0982
irintensity: 0.2603 4.9026 0.0087 5.5738 0.0066 2.7975 3.6215 0.0573 0.4107 1.3316 2.6196 1.7401 12.9334 6.7968 8.7821 9.4288 5.6045 0.1083 10.1462 0.1567 0.5015 2.9633 4.3288 4.8541 4.1757 3.3479 0.2861 16.4476 35.2893 19.1207 347.3487 5.3709 2.9032 3.3527 83.2475 4.4171 0.1069 9.6099 69.2321 0.6693 60.2873 7.3815 1.5677 0.3335 2.3853 0.7763 0.4630 0.0636 5.4886 0.1466 5.9905 1.1705 15.3789 6.6753 3.8595 23.6834 3.6036 1.5731 1.4634 0.8476 4.1517 0.8593 18.3648 105.5377 12.3482 140.6223 0.0078 18.9837 1.9329 0.5488 36.9877 81.9352 51.7528 102.3872 11.5731 1.7293 190.1840 130.4264 3.4234 3.7874 5.1586 4.6492 1.9823 2.0647 42.5098 17.2430 73.6349 103.6924 72.1019 72.7294
temp: 298.150 k
press: 1.00000 atm
elementType: 16 16 8 8 7 7 6 6 6 6 6 6 6 6 6 6 6 6 6 6 1 1 1 1 1 1 1 1 1 1 1 1
symmnumber: 1
zpe: 612052.3 jmol-1
zpe.correction: 0.233118 hartree
zpe.thermalcorrener: 0.251032 hartree
zpe.thermalcorrenthalpy: 0.251976 hartree
zpe.thermalcorrgfe: 0.184789 hartree
zpe.sumelectzpe: -1595.384562 hartree
zpe.sumelectthermal: -1595.366649 hartree
zpe.sumelectthermalent: -1595.365704 hartree
zpe.sumelectthermalfe: -1595.432891 hartree
dipole: -0.0637 -4.6496 0.0241
dipole: 4.6501
quadrupole: -105.1107 -147.4964 -129.0099
quadrupole: -0.3232 20.3842 -0.1183
quadrupole: 22.0950 -20.2907 -1.8042 -0.3232 20.3842 -0.1183
hfenergy: -1595.6176804 hartree
pointgroup: C01 [X(C14H12N2O2S2)]
dipole: 0.0207409 -0.0160938 1.829319 debye
polarizability: 295.4442051|71.8034982|166.3892418|0.6906512|-0.0880549|209.2335304 unknown
InChI: InChI=1S/C14H12N2O2S2/c15-13(17)9-5-1-3-7-11(9)19-20-12-8-4-2-6-10(12)14(16)18/h1-8H,15-16H2
charge 0 multiplicity 1
32 atoms
S  -0.933005 0.735104 1.86358
S  0.92424 -0.721301 1.876614
O  -1.950584 1.277041 -2.752965
O  1.92378 -1.252701 -2.745306
N  -0.642833 1.979987 -0.988439
N  0.637043 -1.974035 -0.972657
C  -2.140427 -0.115548 0.75796
C  2.139625 0.119125 0.771915
C  -2.349824 0.177252 -0.627866
C  2.346249 -0.173119 -0.614436
C  -2.938643 -1.094278 1.41133
C  2.946394 1.089772 1.426816
C  -3.369749 -0.547189 -1.302733
C  3.37206 0.543777 -1.288359
C  -3.939411 -1.800298 0.714765
C  3.95427 1.787089 0.731652
C  -4.152424 -1.522352 -0.654817
C  4.16436 1.509903 -0.638499
C  -1.627423 1.184658 -1.525762
C  1.613924 -1.171777 -1.513854
H  -2.764162 -1.287604 2.474396
H  2.772538 1.283944 2.489817
H  -3.514815 -0.306399 -2.361069
H  3.513629 0.304898 -2.3476
H  -4.926656 -2.058469 -1.213897
H  4.943409 2.039894 -1.196723
H  -4.54477 -2.549415 1.235777
H  4.566477 2.529685 1.253977
H  -0.377795 1.933595 -0.000315
H  -0.170225 2.622403 -1.624413
H  0.380982 -1.93527 0.018179
H  0.158165 -2.611273 -1.609168
