program: Orca
programVersion: 5.0.2
elementType: Cl Cl O O O N C C C C C C C C C C C C C C C C C C C C C C H H H H H H H H H H H H H H H H H H H
charge: 0
multiplicity: 1
keywords: wb97x-d3
keywords: def2-TZVPP
keywords: def2/J RIJCOSX
keywords: DEFGRID2
keywords: scfconv7
keywords: smallprint printgap noloewdin
keywords: NOSOSCF
formula: C22H19Cl2NO3
InChI: InChI=1/C22H19Cl2NO3/c1-22(2)17(12-19(23)24)20(22)21(26)28-18(13-25)14-7-6-10-16(11-14)27-15-8-4-3-5-9-15/h3-12,17-18,20H,1-2H3
47 atoms
Cl -0.706896 4.599898 -0.865248
Cl -3.369096 5.311624 -1.727714
O  1.284527 0.629321 -0.801285
O  0.709771 1.288411 1.266383
O  0.857225 -4.258822 0.260349
N  4.138734 1.325859 -2.239263
C  -2.127945 0.566087 -0.030747
C  -1.990593 2.023402 0.253351
C  -0.896536 1.327925 -0.513265
C  -2.015814 -0.412623 1.110306
C  -3.067924 0.111753 -1.119151
C  -2.833327 3.024809 -0.436802
C  0.41486 1.108941 0.112754
C  -2.365898 4.156884 -0.940732
C  2.598701 0.300751 -0.391242
C  2.792525 -1.199091 -0.263572
C  3.470374 0.867957 -1.42357
C  1.701551 -2.030111 -0.056517
C  4.077682 -1.730779 -0.311954
C  1.90972 -3.394736 0.107029
C  4.263904 -3.095518 -0.164018
C  3.182939 -3.937087 0.052972
C  -0.139285 -3.966099 1.159515
C  -1.427058 -4.353501 0.81707
C  0.121131 -3.365543 2.384901
C  -2.464007 -4.139499 1.713704
C  -0.928709 -3.148621 3.266174
C  -2.222035 -3.532259 2.938246
H  -1.744308 2.275168 1.282131
H  -0.862277 1.493825 -1.584003
H  -1.600937 -1.360935 0.765594
H  -3.008653 -0.615763 1.513965
H  -1.401586 -0.049063 1.931301
H  -2.749293 -0.852863 -1.516729
H  -3.11842 0.813076 -1.952416
H  -4.077239 -0.011443 -0.722426
H  -3.897645 2.83517 -0.517403
H  2.850743 0.78512 0.558491
H  0.690119 -1.645215 -0.03177
H  4.936598 -1.089962 -0.468403
H  5.262425 -3.508579 -0.212246
H  3.325365 -5.003249 0.171865
H  -1.613392 -4.822801 -0.140629
H  1.126597 -3.072916 2.659604
H  -3.467747 -4.442244 1.44605
H  -0.727149 -2.680519 4.220717
H  -3.033803 -3.360641 3.632241
elementType: Cl O N C H
totalener: -2050.67002728 hartree
nucrepener: 2834.25812453 hartree
electener: -4884.92815182 hartree
oneelecener: -8443.56769805 hartree
twoeener: 3558.63954624 hartree
cpcmener: -0.03482596 hartree
kineticenergy: 2044.44945758 hartree
xcener: -151.863535412063 hartree
chargesum: 0.0000000
charge: -0.051287 -0.057234 -0.280347 -0.450799 -0.339852 -0.102218 0.183877 -0.019757 -0.183097 -0.277869 -0.287888 -0.221018 0.412466 0.072857 0.417890 0.009078 -0.208598 -0.167831 -0.224052 0.232849 -0.120550 -0.224623 0.257319 -0.210861 -0.166907 -0.139649 -0.157704 -0.184721 0.111659 0.118775 0.051122 0.111350 0.103522 0.101908 0.097488 0.104094 0.142448 0.138209 0.173431 0.143913 0.162315 0.149497 0.146943 0.154752 0.158543 0.161504 0.159053
qa: -0.0513 -0.0572 -0.2803 -0.4508 -0.3399 -0.1022 0.1839 -0.0198 -0.1831 -0.2779 -0.2879 -0.2210 0.4125 0.0729 0.4179 0.0091 -0.2086 -0.1678 -0.2241 0.2328 -0.1206 -0.2246 0.2573 -0.2109 -0.1669 -0.1396 -0.1577 -0.1847 0.1117 0.1188 0.0511 0.1114 0.1035 0.1019 0.0975 0.1041 0.1424 0.1382 0.1734 0.1439 0.1623 0.1495 0.1469 0.1548 0.1585 0.1615 0.1591
va: 1.2781 1.2489 2.1113 2.0564 2.0639 3.1032 3.7004 3.8866 3.8561 3.8827 3.9127 3.9094 4.1447 4.1900 3.7004 3.7154 4.0455 3.9441 3.9830 3.7768 3.9036 4.0083 3.6880 3.9396 3.8563 3.8706 3.8497 3.8464 1.0225 1.0246 1.0149 1.0018 1.0130 1.0014 0.9987 0.9994 1.0077 1.0245 0.9686 1.0077 0.9886 1.0043 1.0071 0.9983 0.9894 0.9906 0.9911
dispcorr: -0.027922280 hartree
energy: -2050.697949563545
dipole: -5.68946 3.93433 -1.75513 -36.50345 34.87869 -1.62476 13.87973 -12.69517 1.18456
magnitude: 2.66899 au
magnitude: 6.78404 debye
