program: Orca
programVersion: 5.0.2
elementType: Cl Cl O O O N C C C C C C C C C C C C C C C C C C C C C C H H H H H H H H H H H H H H H H H H H
charge: 0
multiplicity: 1
keywords: wb97x-d3
keywords: def2-TZVPP
keywords: def2/J RIJCOSX
keywords: DEFGRID2
keywords: scfconv7
keywords: smallprint printgap noloewdin
keywords: NOSOSCF
formula: C22H19Cl2NO3
InChI: InChI=1/C22H19Cl2NO3/c1-22(2)17(12-19(23)24)20(22)21(26)28-18(13-25)14-7-6-10-16(11-14)27-15-8-4-3-5-9-15/h3-12,17-18,20H,1-2H3
47 atoms
Cl -3.359479 4.989522 1.0854
Cl -2.364666 7.149245 -0.545649
O  1.636934 1.234088 -0.259404
O  -0.283582 0.90949 0.83501
O  0.389518 -4.161597 1.53154
N  4.812529 0.459009 0.206389
C  -1.431346 2.190162 -1.809354
C  -1.489862 3.171506 -0.675172
C  -0.185786 2.465487 -0.986157
C  -2.184786 0.892465 -1.655495
C  -1.395658 2.68349 -3.235016
C  -1.569297 4.619078 -0.899758
C  0.333394 1.472467 -0.03399
C  -2.324956 5.461066 -0.207393
C  2.231692 0.200041 0.516521
C  1.796555 -1.171717 0.058396
C  3.673329 0.364212 0.331612
C  1.30634 -2.073901 0.988256
C  1.888815 -1.518063 -1.284769
C  0.901612 -3.334892 0.570924
C  1.470493 -2.77565 -1.686646
C  0.973904 -3.690829 -0.768839
C  0.528541 -5.524169 1.388872
C  1.776916 -6.100283 1.191571
C  -0.608605 -6.306615 1.505163
C  1.876901 -7.480575 1.103578
C  -0.492285 -7.688277 1.426437
C  0.746035 -8.278978 1.2201
H  -2.000989 2.804178 0.206924
H  0.574102 3.047659 -1.494423
H  -1.656726 0.076052 -2.150036
H  -3.162623 0.986627 -2.129174
H  -2.354034 0.610043 -0.619416
H  -1.00179 1.904782 -3.889257
H  -0.773635 3.5667 -3.367922
H  -2.402955 2.925117 -3.577758
H  -0.962057 5.04425 -1.689847
H  2.022518 0.332418 1.58275
H  1.235265 -1.801124 2.033979
H  2.279081 -0.81866 -2.013187
H  1.528156 -3.053776 -2.729955
H  0.644464 -4.664785 -1.105694
H  2.662376 -5.48247 1.110489
H  -1.573504 -5.841197 1.660534
H  2.847393 -7.933069 0.948385
H  -1.378306 -8.301812 1.519654
H  0.831759 -9.355161 1.153171
elementType: Cl O N C H
totalener: -2050.67300382 hartree
nucrepener: 2656.43861577 hartree
electener: -4707.11161959 hartree
oneelecener: -8088.41109037 hartree
twoeener: 3381.29947078 hartree
cpcmener: -0.03729292 hartree
kineticenergy: 2044.47763815 hartree
xcener: -151.865270845345 hartree
chargesum: 0.0000000
charge: -0.057218 -0.061279 -0.281988 -0.463132 -0.338452 -0.101235 0.089755 0.030510 -0.070775 -0.265498 -0.266175 -0.203877 0.393645 0.040791 0.421538 0.019832 -0.219934 -0.229847 -0.228581 0.258877 -0.149286 -0.162888 0.248180 -0.170949 -0.226366 -0.154164 -0.136899 -0.172498 0.079956 0.101429 0.099901 0.100400 0.094629 0.099783 0.092932 0.101686 0.134699 0.142549 0.138344 0.150042 0.163798 0.159200 0.161695 0.150297 0.163020 0.161471 0.162084
qa: -0.0572 -0.0613 -0.2820 -0.4631 -0.3385 -0.1012 0.0898 0.0305 -0.0708 -0.2655 -0.2662 -0.2039 0.3936 0.0408 0.4215 0.0198 -0.2199 -0.2298 -0.2286 0.2589 -0.1493 -0.1629 0.2482 -0.1709 -0.2264 -0.1542 -0.1369 -0.1725 0.0800 0.1014 0.0999 0.1004 0.0946 0.0998 0.0929 0.1017 0.1347 0.1425 0.1383 0.1500 0.1638 0.1592 0.1617 0.1503 0.1630 0.1615 0.1621
va: 1.2681 1.2439 2.1309 2.0476 2.0579 3.1104 3.7328 3.8773 3.8431 3.9041 3.9084 3.8980 4.1909 4.2083 3.7052 3.6095 4.0856 4.0654 3.9646 3.7589 3.9212 3.8947 3.6997 3.9123 3.9988 3.8881 3.8827 3.8863 1.0484 1.0319 0.9997 1.0008 1.0166 1.0010 1.0054 1.0008 1.0166 1.0167 1.0190 1.0114 0.9899 0.9956 0.9942 1.0052 0.9890 0.9883 0.9889
dispcorr: -0.023287903 hartree
energy: -2050.696291722271
dipole: 5.85397 -6.68080 -0.82683 -40.26440 38.96021 -1.30419 -14.55301 12.80855 -1.74446
magnitude: 2.32974 au
magnitude: 5.92174 debye
