program: Orca
programVersion: 5.0.2
elementType: Cl Cl O O O N C C C C C C C C C C C C C C C C C C C C C C H H H H H H H H H H H H H H H H H H H
charge: 0
multiplicity: 1
keywords: wb97x-d3
keywords: def2-TZVPP
keywords: def2/J RIJCOSX
keywords: DEFGRID2
keywords: scfconv7
keywords: smallprint printgap noloewdin
keywords: NOSOSCF
formula: C22H19Cl2NO3
InChI: InChI=1/C22H19Cl2NO3/c1-22(2)17(12-19(23)24)20(22)21(26)28-18(13-25)14-7-6-10-16(11-14)27-15-8-4-3-5-9-15/h3-12,17-18,20H,1-2H3
47 atoms
Cl -0.485131 6.476451 -0.462393
Cl -2.560177 6.390894 -2.464716
O  0.768091 0.431765 -1.117211
O  1.313377 1.766066 0.59463
O  0.702266 -4.714975 -0.029282
N  2.641868 -0.859344 -3.512897
C  -1.756185 2.334507 0.712118
C  -1.099886 3.410246 -0.099383
C  -0.843736 1.947529 -0.433914
C  -1.317261 2.173505 2.147178
C  -3.220323 2.025877 0.50984
C  -1.837974 4.222109 -1.07274
C  0.50889 1.407482 -0.228593
C  -1.642577 5.515034 -1.298944
C  2.057232 -0.177397 -1.059473
C  2.067914 -1.366687 -0.133176
C  2.36491 -0.561456 -2.437355
C  1.354896 -2.511981 -0.466699
C  2.763542 -1.294838 1.06585
C  1.363229 -3.598021 0.395362
C  2.7547 -2.386045 1.922557
C  2.06334 -3.541986 1.596217
C  0.212372 -5.60965 0.895877
C  -0.674714 -5.201898 1.883135
C  0.584354 -6.938478 0.772141
C  -1.186958 -6.146265 2.760272
C  0.055892 -7.875276 1.650793
C  -0.825804 -7.483185 2.64792
H  -0.276085 3.907984 0.399242
H  -1.351914 1.567056 -1.312192
H  -0.320385 2.561138 2.340983
H  -1.341924 1.124685 2.447178
H  -2.008741 2.716396 2.793494
H  -3.837997 2.75193 1.040981
H  -3.450803 1.038036 0.911323
H  -3.519864 2.029773 -0.537132
H  -2.600989 3.733427 -1.666715
H  2.82077 0.543307 -0.753528
H  0.804738 -2.576922 -1.398979
H  3.31435 -0.400493 1.325644
H  3.30034 -2.342641 2.855427
H  2.084623 -4.388669 2.269757
H  -0.966678 -4.162343 1.966461
H  1.275185 -7.23779 -0.005682
H  -1.8782 -5.833892 3.531835
H  0.342484 -8.914284 1.555617
H  -1.231719 -8.215027 3.333357
elementType: Cl O N C H
totalener: -2050.67282774 hartree
nucrepener: 2648.08287867 hartree
electener: -4698.75570641 hartree
oneelecener: -8071.53141962 hartree
twoeener: 3372.77571321 hartree
cpcmener: -0.03574060 hartree
kineticenergy: 2044.45197383 hartree
xcener: -151.859884602586 hartree
chargesum: 0.0000000
charge: -0.056917 -0.061010 -0.285372 -0.472959 -0.335785 -0.102721 0.091620 0.027732 -0.083485 -0.272949 -0.266782 -0.199925 0.424330 0.041066 0.426855 -0.010915 -0.221417 -0.225313 -0.173382 0.240642 -0.152293 -0.168217 0.250173 -0.176758 -0.224152 -0.151482 -0.137056 -0.172359 0.082254 0.098569 0.094767 0.103115 0.098727 0.101449 0.099771 0.093032 0.133679 0.137002 0.135231 0.149243 0.163599 0.158931 0.162957 0.149543 0.162971 0.161423 0.162564
qa: -0.0569 -0.0610 -0.2854 -0.4730 -0.3358 -0.1027 0.0916 0.0277 -0.0835 -0.2729 -0.2668 -0.1999 0.4243 0.0411 0.4269 -0.0109 -0.2214 -0.2253 -0.1734 0.2406 -0.1523 -0.1682 0.2502 -0.1768 -0.2242 -0.1515 -0.1371 -0.1724 0.0823 0.0986 0.0948 0.1031 0.0987 0.1014 0.0998 0.0930 0.1337 0.1370 0.1352 0.1492 0.1636 0.1589 0.1630 0.1495 0.1630 0.1614 0.1626
va: 1.2685 1.2438 2.1341 2.0348 2.0623 3.1092 3.7206 3.8767 3.8634 3.9041 3.9126 3.8990 4.1462 4.2083 3.7077 3.6788 4.0798 4.0908 3.9342 3.7987 3.9285 3.8929 3.6957 3.9219 4.0010 3.8856 3.8825 3.8863 1.0454 1.0333 1.0178 0.9986 0.9999 1.0004 1.0009 1.0056 1.0173 1.0180 1.0247 1.0085 0.9903 0.9960 0.9939 1.0053 0.9890 0.9884 0.9887
dispcorr: -0.022549235 hartree
energy: -2050.695376976647
dipole: -4.50524 3.17905 -1.32619 -38.09478 36.96934 -1.12544 23.68189 -21.28503 2.39686
magnitude: 2.96147 au
magnitude: 7.52747 debye
