program: Orca
programVersion: 5.0.2
elementType: Cl Cl O O O N C C C C C C C C C C C C C C C C C C C C C C H H H H H H H H H H H H H H H H H H H
charge: 0
multiplicity: 1
keywords: wb97x-d3
keywords: def2-TZVPP
keywords: def2/J RIJCOSX
keywords: DEFGRID2
keywords: scfconv7
keywords: smallprint printgap noloewdin
keywords: NOSOSCF
formula: C22H19Cl2NO3
InChI: InChI=1/C22H19Cl2NO3/c1-22(2)17(12-19(23)24)20(22)21(26)28-18(13-25)14-7-6-10-16(11-14)27-15-8-4-3-5-9-15/h3-12,17-18,20H,1-2H3
47 atoms
Cl -3.654345 0.50583 -1.452923
Cl -4.780235 0.590645 1.201208
O  2.208608 1.470653 0.807392
O  1.438698 1.490195 -1.292199
O  1.238873 -3.513157 -0.224931
N  4.594858 1.902973 -1.683255
C  -0.657886 3.492559 -0.063792
C  -1.272083 2.130438 -0.189671
C  0.067721 2.289548 0.508183
C  -0.16688 4.161772 -1.323358
C  -1.194751 4.472768 0.950643
C  -2.424564 1.716502 0.619804
C  1.267761 1.722246 -0.121756
C  -3.468866 1.030485 0.173711
C  3.44193 0.8911 0.434656
C  3.423785 -0.623893 0.348158
C  4.019272 1.474267 -0.783446
C  2.266956 -1.343173 0.0828
C  4.62695 -1.284379 0.566746
C  2.322555 -2.731808 0.05753
C  4.670501 -2.668341 0.512416
C  3.520569 -3.400278 0.267673
C  -0.045018 -3.085398 0.015984
C  -0.410777 -2.449921 1.196289
C  -0.992209 -3.385765 -0.952309
C  -1.740874 -2.103019 1.39164
C  -2.32077 -3.051073 -0.733943
C  -2.699782 -2.40565 0.434578
H  -1.21749 1.703887 -1.184871
H  0.054042 2.222413 1.589682
H  0.089211 3.461745 -2.114451
H  0.707951 4.780164 -1.117375
H  -0.948677 4.816997 -1.709561
H  -1.459344 4.00721 1.898818
H  -2.082547 4.973556 0.561284
H  -0.446618 5.238498 1.160142
H  -2.430534 1.987564 1.668677
H  4.127395 1.170264 1.239275
H  1.322994 -0.851552 -0.101901
H  5.524794 -0.719658 0.78564
H  5.605346 -3.184875 0.683109
H  3.548665 -4.4819 0.24063
H  0.323982 -2.226376 1.959194
H  -0.691707 -3.88575 -1.864357
H  -2.027494 -1.600134 2.306108
H  -3.059828 -3.292552 -1.486285
H  -3.735584 -2.142427 0.598644
elementType: Cl O N C H
totalener: -2050.66947876 hartree
nucrepener: 2901.83561029 hartree
electener: -4952.50508904 hartree
oneelecener: -8579.38217247 hartree
twoeener: 3626.87708343 hartree
cpcmener: -0.04139021 hartree
kineticenergy: 2044.44525412 hartree
xcener: -151.867689752991 hartree
chargesum: -0.0000000
charge: -0.057236 -0.061487 -0.275267 -0.456537 -0.330832 -0.108376 0.085549 0.051652 -0.077081 -0.268192 -0.267264 -0.227241 0.390373 0.056951 0.437108 -0.011352 -0.224325 -0.223413 -0.246895 0.321762 -0.101517 -0.254792 0.312402 -0.213652 -0.252054 -0.153719 -0.131289 -0.175926 0.084204 0.099308 0.093385 0.102592 0.099446 0.093012 0.102537 0.100102 0.135440 0.154226 0.155246 0.149002 0.161700 0.148671 0.161839 0.148355 0.157762 0.158232 0.157590
qa: -0.0572 -0.0615 -0.2753 -0.4565 -0.3308 -0.1084 0.0855 0.0517 -0.0771 -0.2682 -0.2673 -0.2272 0.3904 0.0570 0.4371 -0.0114 -0.2243 -0.2234 -0.2469 0.3218 -0.1015 -0.2548 0.3124 -0.2137 -0.2521 -0.1537 -0.1313 -0.1759 0.0842 0.0993 0.0934 0.1026 0.0994 0.0930 0.1025 0.1001 0.1354 0.1542 0.1552 0.1490 0.1617 0.1487 0.1618 0.1484 0.1578 0.1582 0.1576
va: 1.2660 1.2432 2.1595 2.0363 2.0860 3.1039 3.7545 3.8311 3.8617 3.9045 3.9051 3.9079 4.1657 4.1932 3.8217 3.7354 4.0578 3.9414 4.0007 3.7378 3.8882 4.0101 3.6428 3.9189 4.0216 3.8255 3.9015 3.8279 1.0459 1.0345 1.0184 0.9992 0.9998 1.0055 1.0002 1.0008 1.0170 0.9971 1.0023 1.0016 0.9878 1.0068 0.9935 1.0068 0.9951 0.9917 1.0054
dispcorr: -0.027889499 hartree
energy: -2050.697368254592
dipole: 14.65593 -15.15251 -0.49658 9.51559 -8.98276 0.53284 5.03982 -2.14184 2.89798
magnitude: 2.98810 au
magnitude: 7.59516 debye
