program: Orca
programVersion: 5.0.2
elementType: Cl Cl O O O N C C C C C C C C C C C C C C C C C C C C C C H H H H H H H H H H H H H H H H H H H
charge: 0
multiplicity: 1
keywords: wb97x-d3
keywords: def2-TZVPP
keywords: def2/J RIJCOSX
keywords: DEFGRID2
keywords: scfconv7
keywords: smallprint printgap noloewdin
keywords: NOSOSCF
formula: C22H19Cl2NO3
InChI: InChI=1/C22H19Cl2NO3/c1-22(2)17(12-19(23)24)20(22)21(26)28-18(13-25)14-7-6-10-16(11-14)27-15-8-4-3-5-9-15/h3-12,17-18,20H,1-2H3
47 atoms
Cl -0.035326 4.909003 1.232399
Cl -1.572742 7.089907 0.128391
O  1.302606 1.249391 -0.487617
O  -0.433756 0.75302 0.829728
O  1.218716 -4.403309 1.233852
N  4.548176 0.670521 -0.499884
C  -1.983695 2.184106 -1.548716
C  -1.922488 3.055037 -0.342471
C  -0.645626 2.44054 -0.86152
C  -2.657476 0.84029 -1.44192
C  -2.129959 2.825139 -2.906377
C  -2.103469 4.520824 -0.428416
C  0.032393 1.405872 -0.070587
C  -1.343623 5.38787 0.224326
C  2.055326 0.229177 0.150409
C  1.655191 -1.15813 -0.296509
C  3.446554 0.495195 -0.219401
C  1.55395 -2.163054 0.651677
C  1.410672 -1.424808 -1.638554
C  1.225385 -3.452047 0.253443
C  1.06888 -2.713337 -2.017853
C  0.97998 -3.735933 -1.08353
C  0.360133 -5.473849 1.174127
C  -0.978464 -5.33067 0.831857
C  0.871647 -6.708529 1.545809
C  -1.803202 -6.446535 0.857459
C  0.031966 -7.812706 1.578419
C  -1.305913 -7.688552 1.230138
H  -2.305144 2.609159 0.572549
H  0.021331 3.09477 -1.411014
H  -3.709064 0.939448 -1.716917
H  -2.624027 0.420132 -0.439006
H  -2.203453 0.122778 -2.127496
H  -1.743453 2.162085 -3.681678
H  -1.593207 3.770992 -2.982369
H  -3.181612 3.016569 -3.12716
H  -2.913702 4.908993 -1.035054
H  1.989378 0.309966 1.240693
H  1.735678 -1.950836 1.698542
H  1.487567 -0.644488 -2.384687
H  0.880233 -2.933444 -3.060008
H  0.730387 -4.738504 -1.405723
H  -1.381604 -4.364868 0.554399
H  1.916304 -6.800988 1.814253
H  -2.84639 -6.338269 0.591182
H  0.431563 -8.774056 1.873246
H  -1.957287 -8.551828 1.251382
elementType: Cl O N C H
totalener: -2050.67068530 hartree
nucrepener: 2705.46389868 hartree
electener: -4756.13458398 hartree
oneelecener: -8186.56657138 hartree
twoeener: 3430.43198739 hartree
cpcmener: -0.03655889 hartree
kineticenergy: 2044.46453499 hartree
xcener: -151.862550654991 hartree
chargesum: 0.0000000
charge: -0.052117 -0.056930 -0.281518 -0.461653 -0.335838 -0.101377 0.134164 -0.019645 -0.145770 -0.271202 -0.280341 -0.216823 0.402990 0.074113 0.415697 0.026519 -0.219878 -0.241176 -0.227177 0.279442 -0.139458 -0.181470 0.289380 -0.198435 -0.251741 -0.145226 -0.124687 -0.186992 0.111720 0.117252 0.100906 0.094272 0.099317 0.100192 0.095535 0.103430 0.143011 0.143948 0.137628 0.150251 0.163281 0.160388 0.161591 0.148436 0.162697 0.161387 0.161903
qa: -0.0521 -0.0569 -0.2815 -0.4617 -0.3358 -0.1014 0.1342 -0.0196 -0.1458 -0.2712 -0.2803 -0.2168 0.4030 0.0741 0.4157 0.0265 -0.2199 -0.2412 -0.2272 0.2794 -0.1395 -0.1815 0.2894 -0.1984 -0.2517 -0.1452 -0.1247 -0.1870 0.1117 0.1173 0.1009 0.0943 0.0993 0.1002 0.0955 0.1034 0.1430 0.1439 0.1376 0.1503 0.1633 0.1604 0.1616 0.1484 0.1627 0.1614 0.1619
va: 1.2780 1.2493 2.1191 2.0454 2.0669 3.1117 3.7233 3.8739 3.8325 3.8931 3.9142 3.9095 4.1413 4.1834 3.7049 3.6135 4.0837 4.0866 3.9576 3.7447 3.9112 3.9136 3.6680 3.9163 4.0079 3.8838 3.8786 3.8980 1.0229 1.0231 1.0017 1.0159 1.0001 1.0029 0.9988 0.9995 1.0073 1.0184 1.0177 1.0119 0.9895 0.9943 0.9955 1.0074 0.9891 0.9881 0.9892
dispcorr: -0.024186889 hartree
energy: -2050.694872193067
dipole: -13.85644 11.25553 -2.60091 -38.53611 37.59164 -0.94447 -14.73736 13.35586 -1.38151
magnitude: 3.09278 au
magnitude: 7.86123 debye
