program: Orca
programVersion: 5.0.2
elementType: Cl Cl O O O N C C C C C C C C C C C C C C C C C C C C C C H H H H H H H H H H H H H H H H H H H
charge: 0
multiplicity: 1
keywords: wb97x-d3
keywords: def2-TZVPP
keywords: def2/J RIJCOSX
keywords: DEFGRID2
keywords: scfconv7
keywords: smallprint printgap noloewdin
keywords: NOSOSCF
formula: C22H19Cl2NO3
InChI: InChI=1/C22H19Cl2NO3/c1-22(2)17(12-19(23)24)20(22)21(26)28-18(13-25)14-7-6-10-16(11-14)27-15-8-4-3-5-9-15/h3-12,17-18,20H,1-2H3
47 atoms
Cl -4.447352 2.799978 0.400276
Cl -3.925505 5.574676 -0.192641
O  1.914455 1.387616 0.323118
O  0.05489 0.204232 0.707436
O  2.041737 -4.386896 0.0540
N  4.974308 1.490782 1.566405
C  -0.820135 1.782236 -1.892351
C  -1.537656 2.305259 -0.680859
C  -0.030659 2.174478 -0.654957
C  -1.016893 0.329901 -2.250615
C  -0.633117 2.667237 -3.100087
C  -2.115843 3.654983 -0.649047
C  0.597184 1.150784 0.19392
C  -3.330933 3.958609 -0.211752
C  2.677897 0.385538 0.989355
C  2.87065 -0.824887 0.109168
C  3.958437 1.021131 1.300427
C  2.380935 -2.051516 0.526633
C  3.483961 -0.689743 -1.132327
C  2.491739 -3.148348 -0.318449
C  3.601462 -1.797386 -1.955277
C  3.098132 -3.028766 -1.55884
C  0.82028 -4.496894 0.674437
C  0.709979 -5.443902 1.682522
C  -0.277799 -3.737995 0.284737
C  -0.515418 -5.637313 2.304149
C  -1.494207 -3.937307 0.921873
C  -1.62052 -4.883571 1.93109
H  -2.072901 1.549937 -0.116432
H  0.538818 3.091619 -0.753348
H  -1.260477 -0.299013 -1.396891
H  -0.122231 -0.07439 -2.728253
H  -1.838475 0.242974 -2.963482
H  0.187436 2.293353 -3.714186
H  -0.402862 3.69993 -2.841939
H  -1.534769 2.666214 -3.714966
H  -1.505976 4.475998 -1.00742
H  2.217005 0.101304 1.940535
H  1.909536 -2.144916 1.497442
H  3.866342 0.269504 -1.458824
H  4.076593 -1.702707 -2.922339
H  3.176973 -3.891052 -2.208367
H  1.575507 -6.025196 1.975657
H  -0.197246 -3.002851 -0.506938
H  -0.600326 -6.376812 3.089949
H  -2.350905 -3.349415 0.618052
H  -2.573646 -5.033932 2.419807
elementType: Cl O N C H
totalener: -2050.67274955 hartree
nucrepener: 2754.86393716 hartree
electener: -4805.53668671 hartree
oneelecener: -8284.98597838 hartree
twoeener: 3479.44929167 hartree
cpcmener: -0.03685588 hartree
kineticenergy: 2044.44756858 hartree
xcener: -151.859617966564 hartree
chargesum: 0.0000000
charge: -0.057595 -0.060525 -0.277695 -0.464194 -0.342405 -0.101686 0.096074 0.033402 -0.083116 -0.264972 -0.260714 -0.204202 0.396289 0.036366 0.422981 0.011404 -0.221478 -0.179180 -0.224639 0.257313 -0.133168 -0.212757 0.276867 -0.242008 -0.182371 -0.130281 -0.160391 -0.182593 0.082275 0.102035 0.088926 0.099692 0.102040 0.099602 0.092164 0.101381 0.136101 0.140342 0.151503 0.149156 0.162657 0.151351 0.149166 0.162070 0.160950 0.162210 0.161649
qa: -0.0576 -0.0605 -0.2777 -0.4642 -0.3424 -0.1017 0.0961 0.0334 -0.0831 -0.2650 -0.2607 -0.2042 0.3963 0.0364 0.4230 0.0114 -0.2215 -0.1792 -0.2246 0.2573 -0.1332 -0.2128 0.2769 -0.2420 -0.1824 -0.1303 -0.1604 -0.1826 0.0823 0.1020 0.0889 0.0997 0.1020 0.0996 0.0922 0.1014 0.1361 0.1403 0.1515 0.1492 0.1627 0.1514 0.1492 0.1621 0.1610 0.1622 0.1616
va: 1.2677 1.2448 2.1356 2.0412 2.0636 3.1100 3.7311 3.8737 3.8532 3.9096 3.9028 3.8891 4.1848 4.2077 3.7163 3.5754 4.0785 3.9256 3.9709 3.7328 3.9065 4.0122 3.6899 3.9975 3.8807 3.8846 3.9012 3.8962 1.0454 1.0324 1.0143 0.9996 1.0016 1.0016 1.0050 1.0011 1.0149 1.0166 1.0074 1.0091 0.9884 1.0032 1.0067 0.9919 0.9880 0.9897 0.9889
dispcorr: -0.024861566 hartree
energy: -2050.697611116098
dipole: 14.22832 -14.90653 -0.67821 -24.54123 24.27037 -0.27086 -13.76184 12.16864 -1.59320
magnitude: 1.75261 au
magnitude: 4.45477 debye
