program: Orca
programVersion: 5.0.2
elementType: Cl Cl O O O N C C C C C C C C C C C C C C C C C C C C C C H H H H H H H H H H H H H H H H H H H
charge: 0
multiplicity: 1
keywords: wb97x-d3
keywords: def2-TZVPP
keywords: def2/J RIJCOSX
keywords: DEFGRID2
keywords: scfconv7
keywords: smallprint printgap noloewdin
keywords: NOSOSCF
formula: C22H19Cl2NO3
InChI: InChI=1/C22H19Cl2NO3/c1-22(2)17(12-19(23)24)20(22)21(26)28-18(13-25)14-7-6-10-16(11-14)27-15-8-4-3-5-9-15/h3-12,17-18,20H,1-2H3
47 atoms
Cl -2.186719 -0.082156 -1.064895
Cl -4.211659 0.57312 0.879568
O  2.110667 2.089631 -0.294309
O  2.27637 2.178125 1.92845
O  0.357066 -2.613681 -1.072575
N  4.145496 1.344809 -2.791404
C  -0.295237 3.943751 -0.111587
C  -0.756948 2.520715 -0.049084
C  0.313253 3.020388 0.921661
C  0.468098 4.386159 -1.337128
C  -1.167252 5.040142 0.453868
C  -2.050168 2.108916 0.505302
C  1.651618 2.410662 0.921904
C  -2.721696 1.023161 0.140656
C  3.236092 1.220887 -0.345576
C  2.83679 -0.1946 -0.004754
C  3.727241 1.305697 -1.720887
C  1.765866 -0.776542 -0.675331
C  3.499477 -0.884976 0.997449
C  1.373608 -2.061052 -0.342047
C  3.097562 -2.175854 1.315804
C  2.038063 -2.771645 0.652491
C  -0.66323 -3.278284 -0.440862
C  -1.132225 -2.909339 0.81385
C  -1.260668 -4.314166 -1.145216
C  -2.205689 -3.596232 1.362131
C  -2.340183 -4.984437 -0.587854
C  -2.814344 -4.634365 0.668945
H  -0.378922 1.896521 -0.84993
H  -0.029894 3.200396 1.933896
H  0.95707 3.571949 -1.86521
H  1.22351 5.128578 -1.075362
H  -0.224713 4.855187 -2.037632
H  -1.945502 5.313336 -0.2604
H  -0.567018 5.930216 0.647767
H  -1.65018 4.763629 1.390219
H  -2.48698 2.714169 1.290557
H  4.041705 1.564321 0.31068
H  1.237369 -0.243704 -1.457553
H  4.32349 -0.422539 1.524826
H  3.614034 -2.724514 2.091562
H  1.7372 -3.780374 0.905374
H  -0.680936 -2.091097 1.359911
H  -0.887756 -4.586477 -2.124565
H  -2.570938 -3.308792 2.339375
H  -2.807126 -5.788516 -1.141411
H  -3.653165 -5.162052 1.102447
elementType: Cl O N C H
totalener: -2050.66945285 hartree
nucrepener: 2915.16683273 hartree
electener: -4965.83628558 hartree
oneelecener: -8605.91178771 hartree
twoeener: 3640.07550212 hartree
cpcmener: -0.03798263 hartree
kineticenergy: 2044.46366221 hartree
xcener: -151.865052996335 hartree
chargesum: 0.0000000
charge: -0.060489 -0.063884 -0.278686 -0.462089 -0.331930 -0.098541 0.097175 0.018932 -0.054525 -0.258774 -0.279514 -0.203597 0.392766 0.061193 0.404413 0.003624 -0.227749 -0.227752 -0.185403 0.231347 -0.126499 -0.170622 0.297365 -0.199387 -0.259482 -0.156834 -0.126793 -0.185297 0.087338 0.097501 0.091076 0.102109 0.095955 0.102544 0.100169 0.095043 0.132738 0.143432 0.143556 0.150849 0.163911 0.160897 0.152503 0.148065 0.161420 0.160670 0.161256
qa: -0.0605 -0.0639 -0.2787 -0.4621 -0.3319 -0.0985 0.0972 0.0189 -0.0545 -0.2588 -0.2795 -0.2036 0.3928 0.0612 0.4044 0.0036 -0.2277 -0.2278 -0.1854 0.2313 -0.1265 -0.1706 0.2974 -0.1994 -0.2595 -0.1568 -0.1268 -0.1853 0.0873 0.0975 0.0911 0.1021 0.0960 0.1025 0.1002 0.0950 0.1327 0.1434 0.1436 0.1508 0.1639 0.1609 0.1525 0.1481 0.1614 0.1607 0.1613
va: 1.2702 1.2410 2.1258 2.0427 2.0422 3.1057 3.7540 3.8704 3.8228 3.8987 3.9200 3.9111 4.1862 4.1797 3.7514 3.6406 4.0773 4.0303 3.9625 3.7933 3.8871 3.9273 3.5933 3.8537 4.0135 3.8969 3.8875 3.8935 1.0262 1.0279 1.0120 1.0006 0.9998 0.9999 1.0003 1.0051 1.0199 1.0141 1.0234 1.0020 0.9888 0.9935 1.0028 1.0079 0.9897 0.9881 0.9889
dispcorr: -0.027845927 hartree
energy: -2050.697298775870
dipole: 8.50235 -9.30491 -0.80257 9.30188 -8.69802 0.60386 4.38829 -2.85868 1.52961
magnitude: 1.82988 au
magnitude: 4.65118 debye
