program: Orca
programVersion: 5.0.2
elementType: Cl Cl O O O N C C C C C C C C C C C C C C C C C C C C C C H H H H H H H H H H H H H H H H H H H
charge: 0
multiplicity: 1
keywords: wb97x-d3
keywords: def2-TZVPP
keywords: def2/J RIJCOSX
keywords: DEFGRID2
keywords: scfconv7
keywords: smallprint printgap noloewdin
keywords: NOSOSCF
formula: C22H19Cl2NO3
InChI: InChI=1/C22H19Cl2NO3/c1-22(2)17(12-19(23)24)20(22)21(26)28-18(13-25)14-7-6-10-16(11-14)27-15-8-4-3-5-9-15/h3-12,17-18,20H,1-2H3
47 atoms
Cl -4.5439 2.877535 -0.091725
Cl -4.008946 5.709859 -0.191113
O  1.716744 1.359062 0.560746
O  -0.210524 0.231161 0.459308
O  2.047297 -4.514811 -0.095366
N  4.618932 1.085212 2.096538
C  -0.534342 2.272723 -1.964382
C  -1.502566 2.562139 -0.851493
C  -0.031398 2.405322 -0.538399
C  -0.604861 0.916797 -2.622305
C  -0.12435 3.369415 -2.915574
C  -2.112237 3.887043 -0.684311
C  0.428668 1.220354 0.203229
C  -3.379768 4.115796 -0.366409
C  2.327596 0.230727 1.174376
C  2.556257 -0.896311 0.193488
C  3.607153 0.724588 1.685338
C  2.163012 -2.180744 0.536828
C  3.154455 -0.634779 -1.033192
C  2.365074 -3.214983 -0.368855
C  3.357189 -1.679813 -1.920473
C  2.960655 -2.968349 -1.598116
C  0.98599 -4.830708 0.717476
C  1.166668 -5.888648 1.596524
C  -0.238725 -4.180854 0.627007
C  0.108417 -6.301307 2.393602
C  -1.28351 -4.595956 1.440737
C  -1.117594 -5.654229 2.324665
H  -2.122777 1.720647 -0.564543
H  0.528211 3.311615 -0.335805
H  -1.024345 0.145407 -1.979699
H  0.386924 0.591354 -2.942897
H  -1.235319 0.977404 -3.51078
H  0.819865 3.111744 -3.397724
H  0.012396 4.332978 -2.4269
H  -0.873818 3.492321 -3.699388
H  -1.4813 4.756592 -0.824486
H  1.743284 -0.120044 2.031196
H  1.704817 -2.362258 1.50132
H  3.4642 0.368597 -1.296819
H  3.824491 -1.491466 -2.877549
H  3.115484 -3.782254 -2.294635
H  2.125753 -6.387937 1.650573
H  -0.385463 -3.361758 -0.065675
H  0.24962 -7.129395 3.075652
H  -2.237018 -4.088718 1.374729
H  -1.938611 -5.973484 2.952471
elementType: Cl O N C H
totalener: -2050.67263057 hartree
nucrepener: 2722.85156383 hartree
electener: -4773.52419440 hartree
oneelecener: -8220.98041122 hartree
twoeener: 3447.45621681 hartree
cpcmener: -0.03697849 hartree
kineticenergy: 2044.45332503 hartree
xcener: -151.861714349706 hartree
chargesum: 0.0000000
charge: -0.057359 -0.061280 -0.276773 -0.459061 -0.335062 -0.100909 0.093504 0.029449 -0.067893 -0.264704 -0.266886 -0.204493 0.383031 0.037723 0.412859 0.025835 -0.219064 -0.207401 -0.253265 0.302520 -0.117610 -0.232693 0.303590 -0.257919 -0.209888 -0.120703 -0.141212 -0.191533 0.078940 0.103264 0.094671 0.098050 0.102624 0.099906 0.093077 0.101891 0.135214 0.143986 0.148189 0.149066 0.162473 0.150626 0.148424 0.160837 0.161691 0.162441 0.161827
qa: -0.0574 -0.0613 -0.2768 -0.4591 -0.3351 -0.1009 0.0935 0.0294 -0.0679 -0.2647 -0.2669 -0.2045 0.3830 0.0377 0.4129 0.0258 -0.2191 -0.2074 -0.2533 0.3025 -0.1176 -0.2327 0.3036 -0.2579 -0.2099 -0.1207 -0.1412 -0.1915 0.0789 0.1033 0.0947 0.0980 0.1026 0.0999 0.0931 0.1019 0.1352 0.1440 0.1482 0.1491 0.1625 0.1506 0.1484 0.1608 0.1617 0.1624 0.1618
va: 1.2680 1.2436 2.1302 2.0469 2.0761 3.1099 3.7378 3.8826 3.8273 3.9053 3.9041 3.8936 4.2090 4.2083 3.7146 3.5816 4.0835 3.9533 3.9564 3.7053 3.8964 4.0068 3.6648 4.0132 3.9167 3.8712 3.8836 3.9046 1.0485 1.0311 1.0141 1.0006 1.0013 1.0010 1.0050 1.0009 1.0162 1.0175 1.0054 1.0117 0.9879 1.0047 1.0077 0.9972 0.9878 0.9892 0.9892
dispcorr: -0.024177245 hartree
energy: -2050.696807817660
dipole: 17.95874 -18.40583 -0.44710 -22.89139 22.84326 -0.04813 -12.26401 10.86044 -1.40357
magnitude: 1.47384 au
magnitude: 3.74621 debye
