program: Orca
programVersion: 5.0.2
elementType: Cl Cl O O O N C C C C C C C C C C C C C C C C C C C C C C H H H H H H H H H H H H H H H H H H H
charge: 0
multiplicity: 1
keywords: wb97x-d3
keywords: def2-TZVPP
keywords: def2/J RIJCOSX
keywords: DEFGRID2
keywords: scfconv7
keywords: smallprint printgap noloewdin
keywords: NOSOSCF
formula: C22H19Cl2NO3
InChI: InChI=1/C22H19Cl2NO3/c1-22(2)17(12-19(23)24)20(22)21(26)28-18(13-25)14-7-6-10-16(11-14)27-15-8-4-3-5-9-15/h3-12,17-18,20H,1-2H3
47 atoms
Cl -2.433438 5.046955 0.885608
Cl -4.156835 4.81881 -1.416573
O  1.488161 0.414935 -1.276246
O  1.418546 1.634659 0.601754
O  1.593757 -3.77226 1.573944
N  3.827186 -0.142741 -3.525869
C  -1.607184 0.655609 0.38783
C  -1.499327 2.128507 0.112649
C  -0.593586 1.164385 -0.622861
C  -1.16057 0.167537 1.74274
C  -2.751543 -0.148639 -0.177394
C  -2.51453 2.843046 -0.670524
C  0.847668 1.134376 -0.332686
C  -2.964176 4.066899 -0.425978
C  2.873807 0.191301 -1.113802
C  3.187977 -1.034166 -0.27433
C  3.393049 0.010782 -2.47184
C  2.176917 -1.834453 0.236739
C  4.522973 -1.33858 -0.039472
C  2.516969 -2.957432 0.984356
C  4.843333 -2.464334 0.70209
C  3.847483 -3.281653 1.211918
C  0.291677 -3.824753 1.137145
C  -0.699432 -3.759642 2.10524
C  -0.029689 -4.012288 -0.201214
C  -2.029498 -3.882818 1.728216
C  -1.364224 -4.118385 -0.565444
C  -2.367421 -4.055601 0.393307
H  -1.019604 2.699052 0.899843
H  -0.845964 0.957401 -1.656504
H  -0.784696 -0.855968 1.681016
H  -2.012995 0.162293 2.424052
H  -0.389363 0.78815 2.193813
H  -2.487222 -1.207462 -0.193187
H  -3.015828 0.136159 -1.194614
H  -3.640077 -0.039278 0.446542
H  -2.932481 2.335626 -1.531804
H  3.374961 1.068458 -0.690349
H  1.136496 -1.598975 0.058893
H  5.307916 -0.706232 -0.43599
H  5.880449 -2.712762 0.882804
H  4.098184 -4.16178 1.790039
H  -0.430842 -3.62136 3.144891
H  0.745969 -4.077261 -0.9540
H  -2.802124 -3.836732 2.484421
H  -1.617944 -4.258691 -1.607867
H  -3.405096 -4.143459 0.100733
elementType: Cl O N C H
totalener: -2050.67227431 hartree
nucrepener: 2804.96781320 hartree
electener: -4855.64008751 hartree
oneelecener: -8384.57826313 hartree
twoeener: 3528.93817563 hartree
cpcmener: -0.03648822 hartree
kineticenergy: 2044.43316260 hartree
xcener: -151.862151627024 hartree
chargesum: -0.0000000
charge: -0.056783 -0.061670 -0.284991 -0.452703 -0.331946 -0.101585 0.119773 0.025966 -0.071241 -0.257573 -0.263503 -0.203446 0.380500 0.035558 0.408032 0.037357 -0.222188 -0.226723 -0.265260 0.349661 -0.096032 -0.264895 0.310692 -0.256207 -0.219115 -0.118693 -0.118927 -0.194986 0.079782 0.100368 0.067526 0.108195 0.102574 0.074664 0.098275 0.105060 0.133168 0.145921 0.132661 0.151732 0.161450 0.148627 0.147161 0.160081 0.160339 0.162621 0.160724
qa: -0.0568 -0.0617 -0.2850 -0.4527 -0.3319 -0.1016 0.1198 0.0260 -0.0712 -0.2576 -0.2635 -0.2034 0.3805 0.0356 0.4080 0.0374 -0.2222 -0.2267 -0.2653 0.3497 -0.0960 -0.2649 0.3107 -0.2562 -0.2191 -0.1187 -0.1189 -0.1950 0.0798 0.1004 0.0675 0.1082 0.1026 0.0747 0.0983 0.1051 0.1332 0.1459 0.1327 0.1517 0.1614 0.1486 0.1472 0.1601 0.1603 0.1626 0.1607
va: 1.2690 1.2432 2.1080 2.0511 2.0861 3.1116 3.6862 3.9102 3.8356 3.8904 3.9065 3.8971 4.1882 4.2101 3.6917 3.6826 4.0574 3.9574 4.0074 3.6635 3.8833 4.0064 3.6203 3.9638 3.9178 3.8237 3.8151 3.8584 1.0480 1.0343 1.0113 1.0018 1.0209 1.0137 1.0087 1.0013 1.0184 1.0208 1.0088 1.0012 0.9879 1.0072 1.0088 0.9948 0.9882 0.9884 0.9909
dispcorr: -0.027149964 hartree
energy: -2050.699424273705
dipole: 4.60258 -5.77131 -1.16873 -35.07808 33.75922 -1.31886 8.05394 -7.31969 0.73424
magnitude: 1.90904 au
magnitude: 4.85240 debye
