program: Orca
programVersion: 5.0.2
elementType: Cl Cl O O O N C C C C C C C C C C C C C C C C C C C C C C H H H H H H H H H H H H H H H H H H H
charge: 0
multiplicity: 1
keywords: wb97x-d3
keywords: def2-TZVPP
keywords: def2/J RIJCOSX
keywords: DEFGRID2
keywords: scfconv7
keywords: smallprint printgap noloewdin
keywords: NOSOSCF
formula: C22H19Cl2NO3
InChI: InChI=1/C22H19Cl2NO3/c1-22(2)17(12-19(23)24)20(22)21(26)28-18(13-25)14-7-6-10-16(11-14)27-15-8-4-3-5-9-15/h3-12,17-18,20H,1-2H3
47 atoms
Cl -2.526453 4.601056 1.960693
Cl -3.568652 5.813397 -0.440612
O  1.869113 1.095766 -1.270365
O  1.313267 1.430631 0.869256
O  0.847565 -3.784336 -0.684298
N  4.53344 0.257291 -3.019298
C  -1.526198 1.029504 -0.573605
C  -1.368293 2.40838 0.008549
C  -0.281949 1.844784 -0.876829
C  -1.462012 -0.142747 0.374875
C  -2.465761 0.795688 -1.730933
C  -2.145127 3.54777 -0.494771
C  1.015658 1.463015 -0.297515
C  -2.668746 4.515361 0.246292
C  3.094733 0.512369 -0.85223
C  2.898561 -0.839708 -0.203758
C  3.885288 0.374114 -2.076561
C  1.952106 -1.716013 -0.719045
C  3.655331 -1.189956 0.903384
C  1.764477 -2.945786 -0.110582
C  3.466287 -2.433156 1.49182
C  2.521762 -3.317065 0.995095
C  0.003771 -4.518766 0.112845
C  -0.614565 -3.970967 1.230661
C  -0.259114 -5.822871 -0.279668
C  -1.498655 -4.75142 1.962377
C  -1.154222 -6.587058 0.455641
C  -1.773027 -6.058241 1.580574
H  -1.137094 2.426141 1.067438
H  -0.227183 2.22708 -1.890209
H  -2.464916 -0.371098 0.738935
H  -0.833469 0.035256 1.24494
H  -1.089948 -1.031437 -0.138778
H  -3.493256 0.703692 -1.375252
H  -2.20662 -0.134838 -2.238068
H  -2.435984 1.590373 -2.474658
H  -2.303294 3.615916 -1.564804
H  3.647132 1.179305 -0.181596
H  1.352778 -1.453705 -1.582745
H  4.384436 -0.498261 1.305523
H  4.057663 -2.716878 2.351872
H  2.382595 -4.282887 1.463896
H  -0.419185 -2.948262 1.529923
H  0.228625 -6.232255 -1.155696
H  -1.980329 -4.327951 2.834302
H  -1.361689 -7.603551 0.147737
H  -2.466373 -6.658896 2.15397
elementType: Cl O N C H
totalener: -2050.67252526 hartree
nucrepener: 2750.89904673 hartree
electener: -4801.57157199 hartree
oneelecener: -8276.90170406 hartree
twoeener: 3475.33013207 hartree
cpcmener: -0.03797321 hartree
kineticenergy: 2044.44778414 hartree
xcener: -151.860651322333 hartree
chargesum: -0.0000000
charge: -0.058147 -0.061504 -0.279398 -0.448839 -0.341443 -0.100638 0.107796 0.028892 -0.067865 -0.280675 -0.267722 -0.202044 0.370947 0.036451 0.418595 0.018609 -0.222265 -0.257311 -0.194582 0.239627 -0.133079 -0.160770 0.291175 -0.183008 -0.245877 -0.171751 -0.129058 -0.178836 0.077865 0.103885 0.109669 0.100429 0.091395 0.102844 0.099699 0.094361 0.133329 0.147664 0.142844 0.149326 0.164098 0.161414 0.162550 0.148067 0.161314 0.160919 0.161051
qa: -0.0581 -0.0615 -0.2794 -0.4488 -0.3414 -0.1006 0.1078 0.0289 -0.0679 -0.2807 -0.2677 -0.2020 0.3709 0.0365 0.4186 0.0186 -0.2223 -0.2573 -0.1946 0.2396 -0.1331 -0.1608 0.2912 -0.1830 -0.2459 -0.1718 -0.1291 -0.1788 0.0779 0.1039 0.1097 0.1004 0.0914 0.1028 0.0997 0.0944 0.1333 0.1477 0.1428 0.1493 0.1641 0.1614 0.1626 0.1481 0.1613 0.1609 0.1611
va: 1.2673 1.2436 2.1206 2.0566 2.0463 3.1098 3.7441 3.9003 3.8164 3.9033 3.9015 3.8930 4.2267 4.2098 3.7033 3.5991 4.0856 4.0018 3.9804 3.7759 3.8969 3.9081 3.6496 3.8786 4.0097 3.9239 3.8836 3.8921 1.0477 1.0311 1.0019 1.0130 0.9998 1.0007 1.0017 1.0052 1.0171 1.0131 1.0239 1.0011 0.9888 0.9930 0.9915 1.0074 0.9906 0.9880 0.9890
dispcorr: -0.025605047 hartree
energy: -2050.698130305123
dipole: 2.65675 -3.74466 -1.08791 -38.55115 37.34104 -1.21011 -0.34893 1.19001 0.84108
magnitude: 1.83176 au
magnitude: 4.65595 debye
