program: Orca
programVersion: 5.0.2
elementType: Cl Cl O O O N C C C C C C C C C C C C C C C C C C C C C C H H H H H H H H H H H H H H H H H H H
charge: 0
multiplicity: 1
keywords: wb97x-d3
keywords: def2-TZVPP
keywords: def2/J RIJCOSX
keywords: DEFGRID2
keywords: scfconv7
keywords: smallprint printgap noloewdin
keywords: NOSOSCF
formula: C22H19Cl2NO3
InChI: InChI=1/C22H19Cl2NO3/c1-22(2)17(12-19(23)24)20(22)21(26)28-18(13-25)14-7-6-10-16(11-14)27-15-8-4-3-5-9-15/h3-12,17-18,20H,1-2H3
47 atoms
Cl -1.521782 0.381789 -1.473692
Cl -4.324883 0.535287 -0.798365
O  1.66984 1.114578 0.336238
O  1.731919 3.083439 -0.711012
O  1.074324 -3.845422 0.286749
N  2.694671 0.773181 -2.915898
C  -0.741141 3.825496 1.087873
C  -1.258146 3.132186 -0.123033
C  -0.140387 2.492062 0.683043
C  0.029559 5.111254 0.920942
C  -1.563533 3.780078 2.353261
C  -2.578528 2.46623 -0.160189
C  1.166034 2.321586 0.034155
C  -2.779752 1.285659 -0.727782
C  2.857665 0.67917 -0.304433
C  3.048589 -0.766296 0.085626
C  2.739892 0.770136 -1.766289
C  1.966036 -1.629615 -0.035057
C  4.269223 -1.217965 0.559372
C  2.102376 -2.948371 0.364352
C  4.400645 -2.553995 0.91929
C  3.322923 -3.419393 0.836258
C  -0.224055 -3.391044 0.375763
C  -0.630684 -2.554483 1.408427
C  -1.127195 -3.838693 -0.574808
C  -1.95763 -2.157426 1.473387
C  -2.456921 -3.447085 -0.486688
C  -2.875327 -2.601176 0.529875
H  -0.9406 3.557021 -1.072321
H  -0.43771 1.653055 1.301436
H  0.806173 5.202201 1.681807
H  -0.649863 5.956095 1.043303
H  0.496941 5.209434 -0.055635
H  -2.315824 4.570414 2.346297
H  -0.927789 3.934995 3.225902
H  -2.078946 2.828554 2.485186
H  -3.4314 2.97437 0.274728
H  3.717721 1.282011 0.002467
H  1.022745 -1.270245 -0.427209
H  5.10637 -0.538535 0.652745
H  5.348466 -2.920397 1.289538
H  3.422409 -4.45422 1.137999
H  0.075684 -2.212569 2.154519
H  -0.795168 -4.490544 -1.372867
H  -2.274759 -1.501898 2.273745
H  -3.164064 -3.79972 -1.225885
H  -3.909118 -2.29054 0.58967
elementType: Cl O N C H
totalener: -2050.66910639 hartree
nucrepener: 2945.33209452 hartree
electener: -4996.00120090 hartree
oneelecener: -8666.80702331 hartree
twoeener: 3670.80582241 hartree
cpcmener: -0.03933049 hartree
kineticenergy: 2044.47507249 hartree
xcener: -151.867142130242 hartree
chargesum: 0.0000000
charge: -0.055156 -0.057951 -0.273259 -0.465085 -0.338057 -0.099005 0.144682 -0.030412 -0.138496 -0.278346 -0.282980 -0.211458 0.409879 0.090939 0.433611 0.017403 -0.237283 -0.192699 -0.219930 0.263755 -0.101242 -0.247788 0.287944 -0.195623 -0.242295 -0.136255 -0.124193 -0.197762 0.119806 0.112786 0.103370 0.096491 0.093588 0.103213 0.100586 0.095177 0.142880 0.137522 0.122968 0.150144 0.161501 0.150091 0.158191 0.148888 0.162266 0.160132 0.157461
qa: -0.0552 -0.0580 -0.2733 -0.4651 -0.3381 -0.0990 0.1447 -0.0304 -0.1385 -0.2783 -0.2830 -0.2115 0.4099 0.0909 0.4336 0.0174 -0.2373 -0.1927 -0.2199 0.2638 -0.1012 -0.2478 0.2879 -0.1956 -0.2423 -0.1363 -0.1242 -0.1978 0.1198 0.1128 0.1034 0.0965 0.0936 0.1032 0.1006 0.0952 0.1429 0.1375 0.1230 0.1501 0.1615 0.1501 0.1582 0.1489 0.1623 0.1601 0.1575
va: 1.2845 1.2487 2.1488 2.0323 2.0713 3.1101 3.7156 3.8773 3.8612 3.8860 3.9165 3.9177 4.1349 4.1440 3.7490 3.6905 4.0398 3.9439 3.9552 3.7726 3.8864 4.0067 3.6517 3.9174 4.0154 3.8316 3.8713 3.8666 1.0181 1.0197 0.9985 1.0010 1.0181 0.9994 1.0026 0.9992 1.0074 1.0119 1.0304 1.0019 0.9879 1.0052 0.9953 1.0057 0.9898 0.9889 0.9980
dispcorr: -0.028734170 hartree
energy: -2050.697840554641
dipole: 7.34696 -7.95631 -0.60935 11.37389 -10.80047 0.57342 18.94423 -15.86462 3.07962
magnitude: 3.19126 au
magnitude: 8.11154 debye
