program: Orca
programVersion: 5.0.2
elementType: Cl Cl O O O N C C C C C C C C C C C C C C C C C C C C C C H H H H H H H H H H H H H H H H H H H
charge: 0
multiplicity: 1
keywords: wb97x-d3
keywords: def2-TZVPP
keywords: def2/J RIJCOSX
keywords: DEFGRID2
keywords: scfconv7
keywords: smallprint printgap noloewdin
keywords: NOSOSCF
formula: C22H19Cl2NO3
InChI: InChI=1/C22H19Cl2NO3/c1-22(2)17(12-19(23)24)20(22)21(26)28-18(13-25)14-7-6-10-16(11-14)27-15-8-4-3-5-9-15/h3-12,17-18,20H,1-2H3
47 atoms
Cl -1.469183 0.378242 -1.459628
Cl -4.27156 0.495484 -0.772861
O  1.679847 1.148411 0.378027
O  1.774866 3.118118 -0.665504
O  1.098352 -3.837355 0.265324
N  2.779975 0.818375 -2.85573
C  -0.746071 3.877099 1.060707
C  -1.239844 3.143345 -0.135948
C  -0.122784 2.541255 0.702065
C  -0.002629 5.173694 0.862906
C  -1.584182 3.854013 2.31669
C  -2.551864 2.461012 -0.166042
C  1.190469 2.360398 0.069527
C  -2.73863 1.271549 -0.720795
C  2.876421 0.708003 -0.241585
C  3.056106 -0.74098 0.141751
C  2.787992 0.805432 -1.705078
C  1.976224 -1.604639 -0.00329
C  4.272403 -1.196447 0.623146
C  2.113098 -2.929587 0.37653
C  4.403751 -2.53675 0.966526
C  3.329831 -3.403145 0.856839
C  -0.21288 -3.422041 0.326604
C  -1.089472 -3.953217 -0.606748
C  -0.66437 -2.55527 1.31482
C  -2.435162 -3.616219 -0.546665
C  -2.007687 -2.211986 1.349913
C  -2.898035 -2.739301 0.423563
H  -0.915269 3.543831 -1.093316
H  -0.41883 1.716495 1.33967
H  0.720394 5.334829 1.663778
H  -0.713769 6.00111 0.890812
H  0.523197 5.228918 -0.086935
H  -0.961175 4.040832 3.192302
H  -2.087227 2.898425 2.467509
H  -2.347875 4.632881 2.280081
H  -3.409943 2.961562 0.267917
H  3.733621 1.3050 0.084696
H  1.037449 -1.241464 -0.402578
H  5.106813 -0.516394 0.733771
H  5.34845 -2.906177 1.341725
H  3.429028 -4.442708 1.141596
H  -0.723811 -4.630227 -1.3682
H  0.01766 -2.148941 2.051082
H  -3.120073 -4.037481 -1.270829
H  -2.359055 -1.531841 2.114734
H  -3.944739 -2.47124 0.461731
elementType: Cl O N C H
totalener: -2050.66920421 hartree
nucrepener: 2940.09988400 hartree
electener: -4990.76908821 hartree
oneelecener: -8656.30988135 hartree
twoeener: 3665.54079313 hartree
cpcmener: -0.03936152 hartree
kineticenergy: 2044.46551954 hartree
xcener: -151.865754884670 hartree
chargesum: 0.0000000
charge: -0.055509 -0.057710 -0.273766 -0.464800 -0.335488 -0.099548 0.148001 -0.033080 -0.144900 -0.277653 -0.282981 -0.207432 0.414420 0.089165 0.431168 0.017872 -0.237162 -0.203375 -0.220242 0.277752 -0.099780 -0.253305 0.305995 -0.255083 -0.208638 -0.118558 -0.132960 -0.200308 0.120494 0.112515 0.101676 0.096722 0.093645 0.100524 0.095694 0.103370 0.142980 0.138073 0.125284 0.149708 0.161513 0.149784 0.148342 0.158513 0.160824 0.161435 0.156811
qa: -0.0555 -0.0577 -0.2738 -0.4648 -0.3355 -0.0995 0.1480 -0.0331 -0.1449 -0.2777 -0.2830 -0.2074 0.4144 0.0892 0.4312 0.0179 -0.2372 -0.2034 -0.2202 0.2778 -0.0998 -0.2533 0.3060 -0.2551 -0.2086 -0.1186 -0.1330 -0.2003 0.1205 0.1125 0.1017 0.0967 0.0936 0.1005 0.0957 0.1034 0.1430 0.1381 0.1253 0.1497 0.1615 0.1498 0.1483 0.1585 0.1608 0.1614 0.1568
va: 1.2842 1.2488 2.1490 2.0327 2.0760 3.1101 3.7159 3.8814 3.8660 3.8845 3.9151 3.9171 4.1308 4.1467 3.7503 3.6928 4.0400 3.9576 3.9569 3.7671 3.8846 4.0057 3.6350 4.0227 3.9188 3.8763 3.8197 3.8783 1.0179 1.0210 0.9990 1.0007 1.0190 1.0029 0.9989 0.9994 1.0069 1.0116 1.0281 1.0020 0.9880 1.0057 1.0067 0.9954 0.9883 0.9900 0.9972
dispcorr: -0.028558665 hartree
energy: -2050.697762878866
dipole: 6.77713 -7.46176 -0.68463 11.48776 -10.94098 0.54678 18.40741 -15.35856 3.04884
magnitude: 3.17224 au
magnitude: 8.06320 debye
