program: Orca
programVersion: 5.0.2
elementType: O O O N C C C C C C C C C C C C C C C C C C C C C C C C H H H H H H H H H H H H H H H H H H H H H H H H H
charge: 0
multiplicity: 1
keywords: wb97x-d3
keywords: def2-TZVPP
keywords: def2/J RIJCOSX
keywords: DEFGRID2
keywords: scfconv7
keywords: smallprint printgap noloewdin
keywords: NOSOSCF
formula: C24H25NO3
InChI: InChI=1/C24H25NO3/c1-16(2)13-20-22(24(20,3)4)23(26)28-21(15-25)17-9-8-12-19(14-17)27-18-10-6-5-7-11-18/h5-14,20-22H,1-4H3
53 atoms
O  -1.189557 1.917079 0.124286
O  -1.223703 1.604444 -2.086879
O  -1.088784 -3.100024 0.675779
N  -3.407539 2.303111 2.532977
C  1.47697 3.370929 -0.413805
C  1.672813 2.028126 0.214683
C  0.841408 2.149127 -1.055266
C  0.637161 4.396449 0.311216
C  2.597285 4.003622 -1.205506
C  2.956665 1.300943 0.206207
C  -0.605245 1.870173 -1.094503
C  3.288485 0.281381 1.00268
C  2.382099 -0.346598 2.015833
C  4.651738 -0.33712 0.928206
C  -2.55524 1.553262 0.178506
C  -2.764171 0.06745 -0.014673
C  -3.018777 1.976429 1.502695
C  -1.826522 -0.831832 0.469122
C  -3.89246 -0.387664 -0.680643
C  -2.002572 -2.187913 0.23642
C  -4.080801 -1.74752 -0.864342
C  -3.130337 -2.653683 -0.421704
C  0.19181 -3.065422 0.208439
C  1.087938 -3.92286 0.838408
C  0.61407 -2.263718 -0.845964
C  2.402171 -3.979803 0.407443
C  1.938959 -2.323578 -1.254749
C  2.83798 -3.179491 -0.640408
H  1.078133 1.883773 1.108531
H  1.318821 1.828686 -1.974218
H  1.28468 5.030885 0.918701
H  0.114663 5.044328 -0.395403
H  -0.101374 3.9584 0.977562
H  3.152442 3.287755 -1.810165
H  2.199877 4.7590 -1.885241
H  3.306818 4.496154 -0.538308
H  3.702497 1.640584 -0.505296
H  2.841522 -0.338774 3.007149
H  1.411112 0.137269 2.099305
H  2.20597 -1.394068 1.759813
H  5.179197 -0.232159 1.879823
H  4.580662 -1.408154 0.726717
H  5.268953 0.115406 0.152758
H  -3.134848 2.099652 -0.573926
H  -0.946713 -0.488989 1.000462
H  -4.61772 0.317083 -1.067157
H  -4.960687 -2.104698 -1.38211
H  -3.253247 -3.715674 -0.587453
H  0.744556 -4.54327 1.655847
H  -0.068894 -1.600008 -1.358889
H  3.091142 -4.654805 0.898203
H  2.262883 -1.689573 -2.068977
H  3.865356 -3.225308 -0.975279
totalener: -1210.07892426 hartree
nucrepener: 2631.26219358 hartree
electener: -3841.34111784 hartree
oneelecener: -6873.12455428 hartree
twoeener: 3031.78343645 hartree
kineticenergy: 1204.77252604 hartree
xcener: -118.595344135400 hartree
chargesum: -0.0000000
charge: -0.280358 -0.338897 -0.296154 0.002813 0.093275 0.054423 -0.052714 -0.254195 -0.277720 -0.214030 0.294704 -0.028603 -0.253804 -0.211989 0.265940 0.102342 -0.256253 -0.209100 -0.152408 0.209643 -0.092685 -0.176251 0.280812 -0.213339 -0.177093 -0.076206 -0.105622 -0.206817 0.097491 0.081229 0.088039 0.091917 0.094710 0.074998 0.094513 0.100509 0.075468 0.102183 0.076668 0.078347 0.091998 0.082032 0.077013 0.126998 0.129557 0.106460 0.129115 0.128188 0.122573 0.138749 0.124679 0.121278 0.135572
qa: -0.2804 -0.3389 -0.2962 0.0028 0.0933 0.0544 -0.0527 -0.2542 -0.2777 -0.2140 0.2947 -0.0286 -0.2538 -0.2120 0.2659 0.1023 -0.2563 -0.2091 -0.1524 0.2096 -0.0927 -0.1763 0.2808 -0.2133 -0.1771 -0.0762 -0.1056 -0.2068 0.0975 0.0812 0.0880 0.0919 0.0947 0.0750 0.0945 0.1005 0.0755 0.1022 0.0767 0.0783 0.0920 0.0820 0.0770 0.1270 0.1296 0.1065 0.1291 0.1282 0.1226 0.1387 0.1247 0.1213 0.1356
va: 2.0795 2.1635 2.1214 3.1172 3.7989 3.7096 3.7972 3.9114 3.9286 3.8954 4.2528 3.7925 3.9549 3.9283 3.8619 3.5855 4.0075 4.0087 4.0364 3.8487 3.9424 4.0530 3.7849 3.9959 3.8783 3.8947 3.8989 3.9303 1.0172 1.0297 1.0031 1.0017 1.0122 1.0091 1.0035 1.0007 1.0216 1.0065 1.0185 1.0028 0.9997 1.0043 1.0121 1.0163 1.0126 1.0124 0.9995 1.0093 1.0168 1.0099 1.0000 1.0061 0.9960
dispcorr: -0.031842759 hartree
energy: -1210.110767019883
dipole: 28.85028 -27.81847 1.03181 8.81104 -9.10129 -0.29025 -0.02885 -0.74796 -0.77681
magnitude: 1.32375 au
magnitude: 3.36471 debye
