program: Orca
programVersion: 5.0.2
elementType: O O O N C C C C C C C C C C C C C C C C C C C C C C C C H H H H H H H H H H H H H H H H H H H H H H H H H
charge: 0
multiplicity: 1
keywords: wb97x-d3
keywords: def2-TZVPP
keywords: def2/J RIJCOSX
keywords: DEFGRID2
keywords: scfconv7
keywords: smallprint printgap noloewdin
keywords: NOSOSCF
formula: C24H25NO3
InChI: InChI=1/C24H25NO3/c1-16(2)13-20-22(24(20,3)4)23(26)28-21(15-25)17-9-8-12-19(14-17)27-18-10-6-5-7-11-18/h5-14,20-22H,1-4H3
53 atoms
O  -0.911305 0.749167 1.473975
O  -0.97808 2.413448 -0.017086
O  -1.879716 -3.276448 -1.623484
N  -3.121322 -0.675384 3.476378
C  2.009397 1.515713 -0.44427
C  1.962825 2.790074 0.343714
C  1.13049 1.612541 0.792866
C  1.393484 1.488958 -1.82149
C  3.221638 0.625393 -0.321806
C  3.09186 3.24055 1.187396
C  -0.337484 1.672979 0.676976
C  3.814977 4.346676 1.003116
C  3.600482 5.314577 -0.1207
C  4.931406 4.706253 1.936917
C  -2.318141 0.609247 1.346788
C  -2.690041 -0.145201 0.092059
C  -2.75196 -0.114608 2.544587
C  -2.083644 -1.369269 -0.162072
C  -3.612728 0.38399 -0.794002
C  -2.408747 -2.062126 -1.318543
C  -3.942087 -0.327703 -1.9390
C  -3.34222 -1.543533 -2.209646
C  -0.640568 -3.606719 -1.145249
C  0.476859 -2.851096 -1.477172
C  -0.519302 -4.742625 -0.361941
C  1.723068 -3.246482 -1.019067
C  0.735142 -5.130786 0.086427
C  1.858007 -4.384528 -0.235924
H  1.38116 3.577511 -0.124386
H  1.489832 1.059079 1.653695
H  1.022997 0.49007 -2.063054
H  0.566458 2.185182 -1.935211
H  2.15063 1.74612 -2.564445
H  2.967079 -0.402514 -0.585869
H  4.009219 0.962239 -0.99795
H  3.639562 0.612561 0.683628
H  3.345757 2.606429 2.03231
H  3.38979 6.315864 0.2636
H  4.50556 5.399688 -0.727577
H  2.787508 5.035292 -0.787105
H  4.752558 5.676927 2.406671
H  5.059094 3.970392 2.730307
H  5.880114 4.790983 1.400566
H  -2.809283 1.587898 1.346777
H  -1.368261 -1.779691 0.540304
H  -4.062855 1.348826 -0.601481
H  -4.660727 0.078682 -2.637708
H  -3.587544 -2.097618 -3.105919
H  0.372493 -1.968244 -2.095617
H  -1.401758 -5.317036 -0.113106
H  2.59654 -2.665081 -1.284242
H  0.830497 -6.018668 0.697098
H  2.833925 -4.689215 0.116749
totalener: -1210.08248831 hartree
nucrepener: 2521.74670895 hartree
electener: -3731.82919726 hartree
oneelecener: -6654.26618121 hartree
twoeener: 2922.43698395 hartree
kineticenergy: 1204.77543269 hartree
xcener: -118.590145562456 hartree
chargesum: -0.0000000
charge: -0.266718 -0.370556 -0.298028 -0.001796 0.116166 0.012025 -0.109741 -0.255996 -0.222968 -0.197314 0.321898 -0.034364 -0.236926 -0.207633 0.322363 0.033681 -0.260772 -0.170512 -0.145097 0.200803 -0.085230 -0.200932 0.201132 -0.156024 -0.171848 -0.126809 -0.103500 -0.133180 0.095658 0.078895 0.073432 0.104610 0.088540 0.069347 0.092465 0.075980 0.080681 0.089188 0.085445 0.082155 0.087110 0.078315 0.083757 0.120964 0.131783 0.107727 0.126939 0.128641 0.144597 0.128723 0.138291 0.128155 0.126482
qa: -0.2667 -0.3706 -0.2980 -0.0018 0.1162 0.0120 -0.1097 -0.2560 -0.2230 -0.1973 0.3219 -0.0344 -0.2369 -0.2076 0.3224 0.0337 -0.2608 -0.1705 -0.1451 0.2008 -0.0852 -0.2009 0.2011 -0.1560 -0.1718 -0.1268 -0.1035 -0.1332 0.0957 0.0789 0.0734 0.1046 0.0885 0.0693 0.0925 0.0760 0.0807 0.0892 0.0854 0.0822 0.0871 0.0783 0.0838 0.1210 0.1318 0.1077 0.1269 0.1286 0.1446 0.1287 0.1383 0.1282 0.1265
va: 2.1259 2.1349 2.1113 3.1228 3.7212 3.8040 3.9226 3.9069 3.9061 3.9002 4.2556 3.7889 3.9490 3.9386 3.8390 3.6684 4.0319 3.9213 4.0186 3.8578 3.9561 4.0362 3.8767 3.9663 4.0284 3.9476 3.9426 3.9729 1.0303 1.0390 1.0089 1.0209 1.0027 1.0220 1.0063 1.0126 1.0182 0.9996 0.9998 1.0131 0.9982 1.0117 0.9985 1.0198 1.0232 1.0151 0.9995 1.0117 0.9962 1.0115 0.9931 0.9988 1.0010
dispcorr: -0.027163468 hartree
energy: -1210.109651776053
dipole: 33.68356 -32.28534 1.39821 21.31057 -20.87771 0.43286 -5.37172 4.30285 -1.06888
magnitude: 1.81242 au
magnitude: 4.60681 debye
