program: Orca
programVersion: 5.0.2
elementType: O O O N C C C C C C C C C C C C C C C C C C C C C C C C H H H H H H H H H H H H H H H H H H H H H H H H H
charge: 0
multiplicity: 1
keywords: wb97x-d3
keywords: def2-TZVPP
keywords: def2/J RIJCOSX
keywords: DEFGRID2
keywords: scfconv7
keywords: smallprint printgap noloewdin
keywords: NOSOSCF
formula: C24H25NO3
InChI: InChI=1/C24H25NO3/c1-16(2)13-20-22(24(20,3)4)23(26)28-21(15-25)17-9-8-12-19(14-17)27-18-10-6-5-7-11-18/h5-14,20-22H,1-4H3
53 atoms
O  -0.905993 1.750398 0.243053
O  -1.428025 2.384211 -1.834532
O  -1.045757 -3.383342 -0.477502
N  -2.626894 1.14923 2.998958
C  1.441052 3.758088 -0.199166
C  1.883544 2.337795 -0.087791
C  0.798731 2.701851 -1.084526
C  0.674019 4.373226 0.946933
C  2.314461 4.755761 -0.921784
C  3.209349 1.868207 -0.563315
C  -0.609591 2.280504 -0.964726
C  3.509734 0.596885 -0.832633
C  2.519618 -0.52053 -0.718891
C  4.888499 0.191523 -1.255556
C  -2.241456 1.311554 0.418521
C  -2.504308 -0.028013 -0.227853
C  -2.440102 1.224083 1.868154
C  -1.608104 -1.071149 -0.023548
C  -3.643117 -0.210726 -0.991589
C  -1.872853 -2.312666 -0.582949
C  -3.897271 -1.457888 -1.544562
C  -3.024121 -2.508554 -1.340424
C  -0.081806 -3.454373 0.488353
C  1.196646 -3.80512 0.083132
C  -0.368606 -3.258343 1.833577
C  2.196386 -3.960348 1.031708
C  0.643321 -3.402202 2.769777
C  1.926963 -3.752548 2.375679
H  1.516942 1.829554 0.798976
H  1.101141 2.74805 -2.12441
H  -0.026381 5.130533 0.58952
H  0.115513 3.645373 1.53095
H  1.36932 4.867339 1.627727
H  1.715656 5.593141 -1.283162
H  3.075983 5.15902 -0.251163
H  2.824086 4.322906 -1.78214
H  3.99163 2.614707 -0.661264
H  2.515316 -1.130128 -1.625557
H  2.779139 -1.192444 0.102927
H  1.501488 -0.17406 -0.552252
H  5.316014 -0.530639 -0.555368
H  4.872011 -0.295493 -2.233723
H  5.567008 1.041777 -1.314627
H  -2.947907 2.049903 0.024889
H  -0.715752 -0.910934 0.568343
H  -4.323869 0.612494 -1.163048
H  -4.784141 -1.611009 -2.144245
H  -3.216406 -3.482902 -1.769497
H  1.398747 -3.960406 -0.968462
H  -1.370568 -2.998507 2.150761
H  3.192251 -4.239744 0.713787
H  0.420627 -3.245787 3.816736
H  2.709655 -3.868463 3.112921
totalener: -1210.07922584 hartree
nucrepener: 2574.96290965 hartree
electener: -3785.04213549 hartree
oneelecener: -6760.76208969 hartree
twoeener: 2975.71995420 hartree
kineticenergy: 1204.77940688 hartree
xcener: -118.592615670761 hartree
chargesum: -0.0000000
charge: -0.278940 -0.339960 -0.294207 -0.002578 0.130926 -0.011099 -0.088462 -0.257954 -0.288023 -0.243258 0.323561 0.010171 -0.209268 -0.213452 0.282303 0.061038 -0.259210 -0.253674 -0.156686 0.296955 -0.075403 -0.220244 0.296415 -0.240761 -0.196737 -0.119184 -0.105306 -0.121417 0.104152 0.085770 0.095153 0.092982 0.087776 0.095574 0.094670 0.081809 0.095767 0.083030 0.096647 0.042668 0.085883 0.086131 0.079136 0.122572 0.127865 0.105985 0.126429 0.127528 0.126082 0.139656 0.129923 0.132956 0.128312
qa: -0.2789 -0.3400 -0.2942 -0.0026 0.1309 -0.0111 -0.0885 -0.2580 -0.2880 -0.2433 0.3236 0.0102 -0.2093 -0.2135 0.2823 0.0610 -0.2592 -0.2537 -0.1567 0.2970 -0.0754 -0.2202 0.2964 -0.2408 -0.1967 -0.1192 -0.1053 -0.1214 0.1042 0.0858 0.0952 0.0930 0.0878 0.0956 0.0947 0.0818 0.0958 0.0830 0.0966 0.0427 0.0859 0.0861 0.0791 0.1226 0.1279 0.1060 0.1264 0.1275 0.1261 0.1397 0.1299 0.1330 0.1283
va: 2.0839 2.1718 2.1310 3.1181 3.7431 3.7954 3.8263 3.9009 3.9238 3.8959 4.2249 3.7843 3.9436 3.9375 3.8812 3.7002 4.0120 3.9718 4.0409 3.7960 3.9488 4.0374 3.7163 3.9952 3.9609 3.8853 3.9428 3.9379 1.0191 1.0306 1.0006 1.0121 1.0044 1.0054 0.9994 1.0051 1.0087 1.0037 1.0008 1.0229 0.9973 0.9992 1.0106 1.0213 1.0166 1.0143 0.9999 1.0131 1.0147 1.0026 0.9985 0.9984 0.9988
dispcorr: -0.029059780 hartree
energy: -1210.108285619174
dipole: 26.95634 -25.92512 1.03122 12.00117 -12.17157 -0.17040 -3.89753 3.33939 -0.55814
magnitude: 1.18490 au
magnitude: 3.01177 debye
