program: Orca
programVersion: 5.0.2
elementType: O O O N C C C C C C C C C C C C C C C C C C C C C C C C H H H H H H H H H H H H H H H H H H H H H H H H H
charge: 0
multiplicity: 1
keywords: wb97x-d3
keywords: def2-TZVPP
keywords: def2/J RIJCOSX
keywords: DEFGRID2
keywords: scfconv7
keywords: smallprint printgap noloewdin
keywords: NOSOSCF
formula: C24H25NO3
InChI: InChI=1/C24H25NO3/c1-16(2)13-20-22(24(20,3)4)23(26)28-21(15-25)17-9-8-12-19(14-17)27-18-10-6-5-7-11-18/h5-14,20-22H,1-4H3
53 atoms
O  -1.31428 1.490625 -1.27473
O  -1.220802 1.991477 0.900405
O  -1.153638 -3.497451 -0.191305
N  -4.271717 2.964721 -0.360665
C  1.479825 3.374165 0.011709
C  1.75353 2.078112 0.710849
C  0.763056 2.113764 -0.43958
C  0.737899 4.449447 0.767371
C  2.493089 3.933648 -0.958871
C  3.016934 1.335195 0.559996
C  -0.663058 1.875635 -0.153746
C  3.690555 0.691495 1.517944
C  3.268688 0.598696 2.952822
C  4.977356 -0.013601 1.204308
C  -2.653676 1.055262 -1.114247
C  -2.750768 -0.202882 -0.276728
C  -3.531825 2.135667 -0.650848
C  -1.918171 -1.257655 -0.630308
C  -3.626755 -0.331139 0.788793
C  -1.941659 -2.430458 0.109701
C  -3.66837 -1.524368 1.495591
C  -2.824467 -2.571617 1.172297
C  0.11897 -3.307813 -0.651458
C  0.569115 -4.176476 -1.635229
C  0.963223 -2.331605 -0.134251
C  1.870618 -4.068811 -2.101463
C  2.25765 -2.226875 -0.61987
C  2.718685 -3.091863 -1.601885
H  1.273293 1.999383 1.679725
H  1.102614 1.705238 -1.384894
H  0.041627 4.052945 1.502356
H  1.454098 5.081641 1.295082
H  0.175403 5.088632 0.084366
H  3.277195 4.471686 -0.423679
H  2.97447 3.168335 -1.566074
H  2.013402 4.636233 -1.641961
H  3.441311 1.318008 -0.439647
H  3.163614 -0.446207 3.254618
H  4.031012 1.033287 3.60408
H  2.328505 1.099786 3.169918
H  5.799556 0.386205 1.803111
H  4.912464 -1.078888 1.440736
H  5.254785 0.081986 0.154939
H  -2.973793 0.824007 -2.134422
H  -1.240983 -1.162416 -1.4705
H  -4.266218 0.490938 1.079709
H  -4.351921 -1.62912 2.327255
H  -2.841016 -3.495859 1.734451
H  -0.09934 -4.933255 -2.024425
H  0.622813 -1.654443 0.639105
H  2.218444 -4.75074 -2.866198
H  2.903328 -1.457818 -0.216594
H  3.731365 -3.006124 -1.972501
totalener: -1210.08105768 hartree
nucrepener: 2578.49933330 hartree
electener: -3788.58039098 hartree
oneelecener: -6767.89965239 hartree
twoeener: 2979.31926142 hartree
kineticenergy: 1204.76706790 hartree
xcener: -118.594258794625 hartree
chargesum: -0.0000000
charge: -0.279314 -0.359415 -0.299719 0.001617 0.066454 0.083018 -0.077608 -0.248903 -0.250103 -0.255145 0.333236 -0.039485 -0.241546 -0.220361 0.422489 -0.021013 -0.284668 -0.265659 -0.134938 0.244645 -0.079376 -0.205893 0.287675 -0.233954 -0.240012 -0.057977 -0.018907 -0.210130 0.095090 0.071566 0.100556 0.087527 0.089790 0.096066 0.072403 0.094786 0.082728 0.087926 0.090767 0.086393 0.099738 0.087023 0.083219 0.122010 0.132301 0.120684 0.128413 0.127599 0.125415 0.136308 0.125148 0.119927 0.121607
qa: -0.2793 -0.3594 -0.2997 0.0016 0.0665 0.0830 -0.0776 -0.2489 -0.2501 -0.2551 0.3332 -0.0395 -0.2415 -0.2204 0.4225 -0.0210 -0.2847 -0.2657 -0.1349 0.2446 -0.0794 -0.2059 0.2877 -0.2340 -0.2400 -0.0580 -0.0189 -0.2101 0.0951 0.0716 0.1006 0.0875 0.0898 0.0961 0.0724 0.0948 0.0827 0.0879 0.0908 0.0864 0.0997 0.0870 0.0832 0.1220 0.1323 0.1207 0.1284 0.1276 0.1254 0.1363 0.1251 0.1199 0.1216
va: 2.1039 2.1384 2.1217 3.1152 3.8056 3.7323 3.8430 3.9151 3.9091 3.8860 4.2081 3.7724 3.9454 3.9154 3.9116 3.7484 4.0540 3.9663 3.9771 3.8454 3.9499 4.0441 3.7865 4.0560 3.9682 3.9060 3.8070 4.0355 1.0310 1.0389 1.0207 1.0000 1.0034 1.0031 1.0108 1.0044 1.0192 0.9990 0.9995 1.0164 1.0011 0.9984 1.0087 0.9886 1.0164 1.0254 0.9999 1.0116 1.0145 1.0059 0.9985 0.9983 1.0047
dispcorr: -0.028421840 hartree
energy: -1210.109479516239
dipole: 32.60359 -30.88912 1.71447 10.70621 -11.47561 -0.76941 7.30517 -7.71868 -0.41351
magnitude: 1.92416 au
magnitude: 4.89083 debye
