program: Orca
programVersion: 5.0.2
elementType: O O O N C C C C C C C C C C C C C C C C C C C C C C C C H H H H H H H H H H H H H H H H H H H H H H H H H
charge: 0
multiplicity: 1
keywords: wb97x-d3
keywords: def2-TZVPP
keywords: def2/J RIJCOSX
keywords: DEFGRID2
keywords: scfconv7
keywords: smallprint printgap noloewdin
keywords: NOSOSCF
formula: C24H25NO3
InChI: InChI=1/C24H25NO3/c1-16(2)13-20-22(24(20,3)4)23(26)28-21(15-25)17-9-8-12-19(14-17)27-18-10-6-5-7-11-18/h5-14,20-22H,1-4H3
53 atoms
O  -1.03577 1.834634 0.239578
O  -1.587982 2.540797 -1.807135
O  -0.859615 -3.223126 -0.668472
N  -2.73666 1.152474 2.989813
C  1.470124 3.598981 -0.109981
C  1.769162 2.140918 -0.270694
C  0.663513 2.776065 -1.099377
C  0.865839 4.071605 1.190654
C  2.397404 4.626385 -0.717948
C  2.968406 1.61902 -0.948299
C  -0.754347 2.396104 -0.95805
C  3.636621 0.505318 -0.63769
C  3.286538 -0.422439 0.485491
C  4.828926 0.08253 -1.44398
C  -2.351897 1.346285 0.411148
C  -2.55568 -0.003721 -0.237298
C  -2.551045 1.245319 1.859923
C  -1.569946 -0.976521 -0.121307
C  -3.733949 -0.266678 -0.914987
C  -1.783936 -2.228349 -0.680275
C  -3.935255 -1.521888 -1.469796
C  -2.970838 -2.504818 -1.350473
C  0.055986 -3.360334 0.333306
C  1.316819 -3.805539 -0.038898
C  -0.249114 -3.148588 1.672394
C  2.275446 -4.041536 0.933877
C  0.725875 -3.373033 2.632916
C  1.988936 -3.818651 2.272443
H  1.406368 1.53527 0.550762
H  0.901342 2.972144 -2.138897
H  0.27271 3.313615 1.695709
H  1.663591 4.367692 1.874161
H  0.23145 4.945529 1.030392
H  2.777659 4.336333 -1.696322
H  1.880028 5.579131 -0.840311
H  3.256743 4.794361 -0.06665
H  3.324719 2.193384 -1.798009
H  2.468328 -0.074965 1.111839
H  3.004065 -1.406116 0.104025
H  4.150057 -0.578592 1.13629
H  5.718395 -0.007808 -0.81552
H  4.666714 -0.899257 -1.896349
H  5.054536 0.785968 -2.244681
H  -3.086808 2.055754 0.016366
H  -0.643007 -0.756288 0.393315
H  -4.487873 0.502798 -1.018121
H  -4.851928 -1.735382 -2.002491
H  -3.120407 -3.485996 -1.780881
H  1.533068 -3.974308 -1.085697
H  -1.235681 -2.818391 1.971096
H  3.25473 -4.395553 0.639494
H  0.486577 -3.205443 3.674618
H  2.740596 -3.997122 3.029098
totalener: -1210.08019524 hartree
nucrepener: 2568.07490980 hartree
electener: -3778.15510504 hartree
oneelecener: -6746.88847869 hartree
twoeener: 2968.73337365 hartree
kineticenergy: 1204.77078163 hartree
xcener: -118.592776791178 hartree
chargesum: 0.0000000
charge: -0.286454 -0.340959 -0.294239 -0.003160 0.079850 0.074162 -0.079446 -0.252557 -0.258511 -0.206193 0.323557 -0.025488 -0.255224 -0.207859 0.277454 0.086822 -0.260350 -0.228527 -0.166509 0.276343 -0.076203 -0.220208 0.299374 -0.229722 -0.203835 -0.123246 -0.111277 -0.126315 0.080779 0.077541 0.093467 0.087119 0.091031 0.074827 0.093127 0.095467 0.072166 0.082547 0.083872 0.088995 0.084523 0.085571 0.077503 0.125802 0.125571 0.106996 0.127466 0.128047 0.126360 0.141668 0.129595 0.132633 0.126048
qa: -0.2865 -0.3410 -0.2942 -0.0032 0.0799 0.0742 -0.0794 -0.2526 -0.2585 -0.2062 0.3236 -0.0255 -0.2552 -0.2079 0.2775 0.0868 -0.2604 -0.2285 -0.1665 0.2763 -0.0762 -0.2202 0.2994 -0.2297 -0.2038 -0.1232 -0.1113 -0.1263 0.0808 0.0775 0.0935 0.0871 0.0910 0.0748 0.0931 0.0955 0.0722 0.0825 0.0839 0.0890 0.0845 0.0856 0.0775 0.1258 0.1256 0.1070 0.1275 0.1280 0.1264 0.1417 0.1296 0.1326 0.1260
va: 2.0824 2.1700 2.1305 3.1172 3.7395 3.7306 3.8402 3.9197 3.9298 3.9241 4.2645 3.8200 3.9427 3.9348 3.8748 3.6431 4.0090 3.9920 4.0461 3.8092 3.9448 4.0423 3.7429 3.9739 3.9505 3.8958 3.9369 3.9282 1.0254 1.0327 1.0116 1.0024 1.0023 1.0110 1.0036 1.0024 1.0221 1.0149 1.0041 1.0029 0.9984 0.9977 1.0125 1.0218 1.0128 1.0130 0.9999 1.0130 1.0160 1.0012 0.9986 0.9986 0.9998
dispcorr: -0.028115327 hartree
energy: -1210.108310568239
dipole: 28.91321 -27.89126 1.02194 10.45769 -10.69676 -0.23907 -1.13222 0.63863 -0.49359
magnitude: 1.15981 au
magnitude: 2.94799 debye
