program: Orca
programVersion: 5.0.2
elementType: O O O N C C C C C C C C C C C C C C C C C C C C C C C C H H H H H H H H H H H H H H H H H H H H H H H H H
charge: 0
multiplicity: 1
keywords: wb97x-d3
keywords: def2-TZVPP
keywords: def2/J RIJCOSX
keywords: DEFGRID2
keywords: scfconv7
keywords: smallprint printgap noloewdin
keywords: NOSOSCF
formula: C24H25NO3
InChI: InChI=1/C24H25NO3/c1-16(2)13-20-22(24(20,3)4)23(26)28-21(15-25)17-9-8-12-19(14-17)27-18-10-6-5-7-11-18/h5-14,20-22H,1-4H3
53 atoms
O  -1.091338 1.866086 -0.634516
O  0.689188 0.513208 -0.705595
O  -1.958116 -3.792957 0.428033
N  -3.955095 2.022952 -2.273431
C  1.636736 2.409453 1.6232
C  2.354613 2.767963 0.360708
C  0.851078 2.663128 0.34318
C  1.777211 1.010052 2.170714
C  1.467843 3.457314 2.696187
C  2.992472 4.092275 0.138545
C  0.195623 1.557453 -0.376694
C  4.132381 4.493739 0.702102
C  4.915742 3.653761 1.663839
C  4.726643 5.834559 0.394441
C  -1.873719 0.839673 -1.22765
C  -2.282828 -0.198333 -0.210345
C  -3.038523 1.51558 -1.803471
C  -1.915364 -1.52072 -0.40643
C  -2.989018 0.182616 0.922395
C  -2.255038 -2.474161 0.545752
C  -3.327302 -0.778485 1.861183
C  -2.961287 -2.101688 1.683137
C  -1.005259 -4.219279 -0.456939
C  -1.373946 -5.175254 -1.389907
C  0.302834 -3.757219 -0.392094
C  -0.421238 -5.678527 -2.263488
C  1.242209 -4.259604 -1.278553
C  0.886183 -5.22024 -2.21483
H  2.851419 1.92915 -0.121649
H  0.297846 3.596009 0.329827
H  0.869252 0.697769 2.689936
H  1.993984 0.272557 1.401996
H  2.593641 0.984683 2.89534
H  1.33982 4.457814 2.286079
H  0.599021 3.230737 3.316286
H  2.343473 3.482283 3.347722
H  2.496249 4.760899 -0.559048
H  4.448172 2.692473 1.867453
H  5.919846 3.461583 1.277497
H  5.046243 4.17446 2.615755
H  4.109114 6.409051 -0.294647
H  4.855432 6.42537 1.30469
H  5.718888 5.730228 -0.051186
H  -1.327592 0.360842 -2.047098
H  -1.355785 -1.795763 -1.29091
H  -3.276584 1.21547 1.070887
H  -3.881059 -0.495502 2.746301
H  -3.221195 -2.853231 2.416845
H  -2.397824 -5.523624 -1.422136
H  0.58438 -3.008509 0.337432
H  -0.707532 -6.427907 -2.989385
H  2.260427 -3.897149 -1.232681
H  1.625457 -5.610263 -2.901242
totalener: -1210.08264702 hartree
nucrepener: 2470.47759855 hartree
electener: -3680.56024556 hartree
oneelecener: -6551.92541130 hartree
twoeener: 2871.36516573 hartree
kineticenergy: 1204.77748896 hartree
xcener: -118.590519121428 hartree
chargesum: -0.0000000
charge: -0.260401 -0.381790 -0.293630 -0.002416 0.056768 -0.027567 -0.083975 -0.257133 -0.247708 -0.194382 0.340726 -0.018863 -0.247999 -0.208456 0.313777 0.003216 -0.256666 -0.130209 -0.205233 0.251221 -0.086108 -0.203461 0.242392 -0.193928 -0.174947 -0.098429 -0.107640 -0.136825 0.109649 0.087152 0.094697 0.096486 0.083868 0.086265 0.098883 0.085243 0.092268 0.083527 0.099770 0.090407 0.080748 0.084355 0.087263 0.114521 0.114853 0.122739 0.127846 0.127228 0.126089 0.134160 0.126540 0.128291 0.126814
qa: -0.2604 -0.3818 -0.2936 -0.0024 0.0568 -0.0276 -0.0840 -0.2571 -0.2477 -0.1944 0.3407 -0.0189 -0.2480 -0.2085 0.3138 0.0032 -0.2567 -0.1302 -0.2052 0.2512 -0.0861 -0.2035 0.2424 -0.1939 -0.1749 -0.0984 -0.1076 -0.1368 0.1096 0.0872 0.0947 0.0965 0.0839 0.0863 0.0989 0.0852 0.0923 0.0835 0.0998 0.0904 0.0807 0.0844 0.0873 0.1145 0.1149 0.1227 0.1278 0.1272 0.1261 0.1342 0.1265 0.1283 0.1268
va: 2.1312 2.1250 2.1211 3.1223 3.7529 3.8238 3.8287 3.9064 3.9064 3.8656 4.2419 3.7379 3.9354 3.9380 3.8513 3.6798 4.0212 3.9185 4.0375 3.8642 3.9392 4.0305 3.7986 4.0450 3.9772 3.9314 3.9419 3.9536 1.0227 1.0339 1.0027 1.0196 1.0036 1.0072 1.0062 1.0019 1.0131 1.0092 1.0044 0.9983 1.0105 0.9994 0.9984 1.0222 1.0197 1.0176 0.9991 1.0128 1.0126 1.0026 0.9992 0.9994 1.0002
dispcorr: -0.026316973 hartree
energy: -1210.108963987817
dipole: 32.30354 -30.72845 1.57509 21.55102 -21.67586 -0.12484 15.43243 -14.43988 0.99255
magnitude: 1.86591 au
magnitude: 4.74278 debye
