program: Orca
programVersion: 5.0.2
elementType: O O O N C C C C C C C C C C C C C C C C C C C C C C C C H H H H H H H H H H H H H H H H H H H H H H H H H
charge: 0
multiplicity: 1
keywords: wb97x-d3
keywords: def2-TZVPP
keywords: def2/J RIJCOSX
keywords: DEFGRID2
keywords: scfconv7
keywords: smallprint printgap noloewdin
keywords: NOSOSCF
formula: C24H25NO3
InChI: InChI=1/C24H25NO3/c1-16(2)13-20-22(24(20,3)4)23(26)28-21(15-25)17-9-8-12-19(14-17)27-18-10-6-5-7-11-18/h5-14,20-22H,1-4H3
53 atoms
O  -1.281704 1.806943 1.195469
O  -0.830202 2.618384 -0.839133
O  -0.237523 -2.937361 0.016523
N  -3.990859 0.743721 2.766188
C  2.093791 2.066951 0.271576
C  1.829536 3.535342 0.128388
C  0.840991 2.68785 0.877703
C  1.990718 1.181081 -0.946219
C  3.134306 1.605382 1.261939
C  2.613532 4.562882 0.861745
C  -0.477714 2.400704 0.286335
C  3.825167 4.989269 0.504528
C  4.56043 4.462658 -0.689876
C  4.54244 6.049358 1.283313
C  -2.498379 1.286201 0.69086
C  -2.277873 0.038536 -0.13501
C  -3.320375 0.987082 1.866177
C  -1.385613 -0.925283 0.310422
C  -2.971698 -0.142171 -1.320845
C  -1.174446 -2.0682 -0.446894
C  -2.766628 -1.296487 -2.05986
C  -1.868786 -2.262179 -1.636317
C  -0.317365 -4.261801 -0.317538
C  0.783946 -4.851553 -0.916589
C  -1.448641 -5.010276 -0.019125
C  0.754203 -6.206379 -1.21428
C  -1.469075 -6.36044 -0.329634
C  -0.371366 -6.963447 -0.928037
H  1.485173 3.832376 -0.859403
H  0.846021 2.754146 1.960713
H  1.287921 1.554066 -1.687558
H  2.968682 1.106357 -1.426249
H  1.682463 0.169932 -0.672503
H  2.929453 0.58327 1.58466
H  4.126207 1.616654 0.805743
H  3.1781 2.23749 2.147545
H  2.14622 5.004744 1.737071
H  5.533985 4.059853 -0.399919
H  4.016153 3.678537 -1.212718
H  4.759227 5.264893 -1.404903
H  4.759869 6.918044 0.657159
H  3.963015 6.391183 2.139873
H  5.503669 5.682448 1.651551
H  -3.026241 2.034028 0.089292
H  -0.842344 -0.799966 1.23889
H  -3.656576 0.617368 -1.674514
H  -3.298665 -1.441051 -2.990477
H  -1.705635 -3.14933 -2.233684
H  1.656919 -4.251961 -1.138696
H  -2.301784 -4.543303 0.456577
H  1.615358 -6.668283 -1.678666
H  -2.348439 -6.945664 -0.095481
H  -0.392688 -8.018526 -1.164782
totalener: -1210.08189670 hartree
nucrepener: 2454.95067330 hartree
electener: -3665.03257001 hartree
oneelecener: -6520.87648549 hartree
twoeener: 2855.84391548 hartree
kineticenergy: 1204.77968539 hartree
xcener: -118.590165984137 hartree
chargesum: 0.0000000
charge: -0.268596 -0.358258 -0.301183 -0.002385 0.070719 -0.023116 -0.083410 -0.263939 -0.246252 -0.194219 0.300810 -0.023876 -0.240369 -0.209865 0.321453 0.085176 -0.258364 -0.266313 -0.147278 0.232755 -0.109973 -0.152815 0.202711 -0.182718 -0.144357 -0.106696 -0.122938 -0.127213 0.109952 0.086752 0.104377 0.086404 0.090417 0.099196 0.086267 0.085297 0.090382 0.087759 0.081775 0.098786 0.086985 0.080356 0.084442 0.123155 0.124626 0.105577 0.128208 0.134408 0.125253 0.137121 0.126030 0.129373 0.127614
qa: -0.2686 -0.3583 -0.3012 -0.0024 0.0707 -0.0231 -0.0834 -0.2639 -0.2463 -0.1942 0.3008 -0.0239 -0.2404 -0.2099 0.3215 0.0852 -0.2584 -0.2663 -0.1473 0.2328 -0.1100 -0.1528 0.2027 -0.1827 -0.1444 -0.1067 -0.1229 -0.1272 0.1100 0.0868 0.1044 0.0864 0.0904 0.0992 0.0863 0.0853 0.0904 0.0878 0.0818 0.0988 0.0870 0.0804 0.0844 0.1232 0.1246 0.1056 0.1282 0.1344 0.1253 0.1371 0.1260 0.1294 0.1276
va: 2.1113 2.1464 2.0833 3.1233 3.7439 3.8254 3.8249 3.9040 3.9033 3.8600 4.2994 3.7425 3.9350 3.9386 3.8209 3.6266 4.0288 4.0457 4.0391 3.8199 3.9738 3.9432 3.8475 4.0267 3.9581 3.9421 3.9458 3.9460 1.0242 1.0333 1.0173 1.0041 1.0049 1.0061 1.0021 1.0071 1.0131 0.9994 1.0109 1.0033 0.9983 1.0106 0.9991 1.0184 1.0323 1.0136 1.0012 1.0045 1.0117 1.0025 0.9996 0.9996 0.9997
dispcorr: -0.026551980 hartree
energy: -1210.108448682076
dipole: 32.84905 -31.47789 1.37115 16.74113 -17.17419 -0.43306 -4.45980 3.34738 -1.11241
magnitude: 1.81798 au
magnitude: 4.62095 debye
