program: Orca
programVersion: 5.0.2
elementType: O O O N C C C C C C C C C C C C C C C C C C C C C C C C H H H H H H H H H H H H H H H H H H H H H H H H H
charge: 0
multiplicity: 1
keywords: wb97x-d3
keywords: def2-TZVPP
keywords: def2/J RIJCOSX
keywords: DEFGRID2
keywords: scfconv7
keywords: smallprint printgap noloewdin
keywords: NOSOSCF
formula: C24H25NO3
InChI: InChI=1/C24H25NO3/c1-16(2)13-20-22(24(20,3)4)23(26)28-21(15-25)17-9-8-12-19(14-17)27-18-10-6-5-7-11-18/h5-14,20-22H,1-4H3
53 atoms
O  0.019363 0.687623 1.000366
O  -0.847856 2.62313 0.287835
O  -1.584835 -3.437685 -2.014663
N  -1.079192 -1.506186 3.229824
C  1.969313 2.983118 -1.042714
C  1.944107 3.729944 0.254587
C  1.521732 2.271564 0.222824
C  0.969117 3.361203 -2.108082
C  3.291584 2.531425 -1.615831
C  3.162955 4.10512 0.996205
C  0.112815 1.927765 0.481084
C  3.436397 5.293983 1.538676
C  2.539662 6.4926 1.470971
C  4.717683 5.518746 2.28533
C  -1.292793 0.210309 1.271084
C  -1.912066 -0.432923 0.054533
C  -1.154716 -0.748546 2.370087
C  -1.435667 -1.659647 -0.392164
C  -2.92992 0.218347 -0.626037
C  -2.007239 -2.248625 -1.510835
C  -3.481595 -0.372956 -1.753023
C  -3.03205 -1.604425 -2.194637
C  -1.110269 -4.410544 -1.177819
C  0.029563 -5.093324 -1.573928
C  -1.765658 -4.750313 -0.000923
C  0.515442 -6.125362 -0.785248
C  -1.2613 -5.774723 0.783998
C  -0.121645 -6.465883 0.398274
H  1.107818 4.414267 0.345013
H  2.232556 1.557602 0.623541
H  0.721439 2.501288 -2.733208
H  0.042156 3.757081 -1.702071
H  1.402889 4.125064 -2.75583
H  3.996161 2.200375 -0.854588
H  3.14279 1.701527 -2.308253
H  3.763778 3.346427 -2.166823
H  3.904972 3.321719 1.118972
H  1.612144 6.317706 0.931267
H  2.280114 6.837855 2.47443
H  3.051454 7.324142 0.980448
H  4.521474 5.815785 3.318596
H  5.343857 4.627786 2.308108
H  5.299282 6.326888 1.834665
H  -1.932906 1.026394 1.620097
H  -0.635839 -2.160643 0.140424
H  -3.283083 1.181944 -0.284962
H  -4.277599 0.12701 -2.288079
H  -3.467955 -2.076125 -3.065391
H  0.524294 -4.81735 -2.495808
H  -2.659094 -4.221394 0.305015
H  1.403854 -6.658504 -1.096813
H  -1.767584 -6.033347 1.70428
H  0.265513 -7.264709 1.015789
totalener: -1210.08440544 hartree
nucrepener: 2430.57749613 hartree
electener: -3640.66190157 hartree
oneelecener: -6472.30029675 hartree
twoeener: 2831.63839517 hartree
kineticenergy: 1204.76869307 hartree
xcener: -118.590187351737 hartree
chargesum: -0.0000000
charge: -0.264783 -0.392271 -0.298681 -0.005618 0.086097 0.041184 -0.109559 -0.254055 -0.243437 -0.184380 0.366937 -0.053052 -0.235212 -0.201335 0.335514 0.005135 -0.266913 -0.181745 -0.131894 0.214695 -0.094112 -0.199042 0.244474 -0.211013 -0.165649 -0.090608 -0.101046 -0.144844 0.090713 0.075921 0.087869 0.098466 0.086918 0.072163 0.093327 0.093151 0.073001 0.081935 0.087934 0.086275 0.085922 0.077051 0.083994 0.119836 0.128561 0.118257 0.127584 0.128083 0.125087 0.132628 0.125253 0.128995 0.126291
qa: -0.2648 -0.3923 -0.2987 -0.0056 0.0861 0.0412 -0.1096 -0.2541 -0.2434 -0.1844 0.3669 -0.0531 -0.2352 -0.2013 0.3355 0.0051 -0.2669 -0.1817 -0.1319 0.2147 -0.0941 -0.1990 0.2445 -0.2110 -0.1656 -0.0906 -0.1010 -0.1448 0.0907 0.0759 0.0879 0.0985 0.0869 0.0722 0.0933 0.0932 0.0730 0.0819 0.0879 0.0863 0.0859 0.0771 0.0840 0.1198 0.1286 0.1183 0.1276 0.1281 0.1251 0.1326 0.1253 0.1290 0.1263
va: 2.1339 2.1122 2.1140 3.1182 3.7346 3.7923 3.8976 3.9135 3.9163 3.9014 4.2042 3.8301 3.9456 3.9344 3.8261 3.6592 4.0303 3.9780 3.9822 3.8578 3.9533 4.0344 3.8019 4.0449 3.9518 3.9331 3.9524 3.9656 1.0322 1.0388 1.0027 1.0211 1.0009 1.0111 1.0043 1.0040 1.0217 1.0153 0.9991 0.9994 0.9984 1.0123 0.9985 1.0205 1.0158 1.0212 0.9998 1.0117 1.0135 1.0034 0.9990 0.9999 1.0003
dispcorr: -0.024463829 hartree
energy: -1210.108869270933
dipole: 24.55792 -24.01133 0.54659 31.34342 -30.61225 0.73117 -2.75473 1.84771 -0.90702
magnitude: 1.28687 au
magnitude: 3.27097 debye
