program: Orca
programVersion: 5.0.2
elementType: O O O N C C C C C C C C C C C C C C C C C C C C C C C C H H H H H H H H H H H H H H H H H H H H H H H H H
charge: 0
multiplicity: 1
keywords: wb97x-d3
keywords: def2-TZVPP
keywords: def2/J RIJCOSX
keywords: DEFGRID2
keywords: scfconv7
keywords: smallprint printgap noloewdin
keywords: NOSOSCF
formula: C24H25NO3
InChI: InChI=1/C24H25NO3/c1-16(2)13-20-22(24(20,3)4)23(26)28-21(15-25)17-9-8-12-19(14-17)27-18-10-6-5-7-11-18/h5-14,20-22H,1-4H3
53 atoms
O  -1.183419 1.698288 1.321015
O  -0.938881 2.555284 -0.730271
O  -0.306935 -3.12529 0.209388
N  -3.763419 0.618935 3.09748
C  2.098396 2.205895 0.093531
C  1.711293 3.65234 0.065491
C  0.862072 2.685704 0.844596
C  1.953222 1.383554 -1.163341
C  3.2553 1.775463 0.961351
C  2.47285 4.701529 0.79197
C  -0.48437 2.337296 0.358567
C  3.636763 5.211859 0.388346
C  4.336522 4.774179 -0.862511
C  4.330843 6.28721 1.167468
C  -2.430175 1.158404 0.915811
C  -2.251802 -0.086818 0.078211
C  -3.159606 0.859397 2.15051
C  -1.386886 -1.079845 0.512364
C  -2.941876 -0.227374 -1.115729
C  -1.20375 -2.218603 -0.259987
C  -2.760713 -1.37333 -1.872406
C  -1.89263 -2.370781 -1.458814
C  -0.326758 -4.404974 -0.276953
C  -1.410837 -5.237244 -0.032458
C  0.775404 -4.86284 -0.979977
C  -1.385514 -6.539125 -0.50577
C  0.79264 -6.171125 -1.442214
C  -0.287002 -7.009778 -1.212353
H  1.254542 3.972359 -0.868156
H  0.963744 2.694926 1.924751
H  1.164446 1.743076 -1.819724
H  2.88894 1.408608 -1.725622
H  1.74111 0.339187 -0.926303
H  4.198505 1.893625 0.424232
H  3.328774 2.358948 1.877727
H  3.158603 0.723642 1.235111
H  2.02763 5.08667 1.704968
H  5.345661 4.418595 -0.639677
H  3.809396 3.98082 -1.389018
H  4.450827 5.614233 -1.552446
H  5.330619 5.967144 1.471521
H  4.462766 7.187846 0.562743
H  3.779363 6.56488 2.064932
H  -3.011472 1.897027 0.353837
H  -0.845919 -0.982111 1.44567
H  -3.602153 0.557232 -1.460699
H  -3.288652 -1.488547 -2.809418
H  -1.751844 -3.250676 -2.0718
H  -2.262145 -4.869058 0.525974
H  1.611701 -4.199176 -1.156185
H  -2.227981 -7.190901 -0.316255
H  1.653538 -6.531756 -1.989355
H  -0.27202 -8.02767 -1.577599
totalener: -1210.08204903 hartree
nucrepener: 2444.78157123 hartree
electener: -3654.86362026 hartree
oneelecener: -6500.57349082 hartree
twoeener: 2845.70987056 hartree
kineticenergy: 1204.77741089 hartree
xcener: -118.589558838141 hartree
chargesum: 0.0000000
charge: -0.268417 -0.364809 -0.296440 -0.002838 0.064803 -0.023244 -0.081907 -0.259367 -0.248123 -0.196177 0.311022 -0.020961 -0.243743 -0.209424 0.326075 0.061248 -0.259226 -0.247122 -0.139759 0.233938 -0.116042 -0.158395 0.195196 -0.145841 -0.167723 -0.123511 -0.114694 -0.121538 0.110944 0.086834 0.103621 0.083868 0.090676 0.085366 0.085735 0.099700 0.091052 0.088452 0.082549 0.099526 0.084508 0.086849 0.080341 0.120621 0.121236 0.106436 0.127942 0.132016 0.137892 0.125486 0.129737 0.127758 0.127877
qa: -0.2684 -0.3648 -0.2964 -0.0028 0.0648 -0.0232 -0.0819 -0.2594 -0.2481 -0.1962 0.3110 -0.0210 -0.2437 -0.2094 0.3261 0.0612 -0.2592 -0.2471 -0.1398 0.2339 -0.1160 -0.1584 0.1952 -0.1458 -0.1677 -0.1235 -0.1147 -0.1215 0.1109 0.0868 0.1036 0.0839 0.0907 0.0854 0.0857 0.0997 0.0911 0.0885 0.0825 0.0995 0.0845 0.0868 0.0803 0.1206 0.1212 0.1064 0.1279 0.1320 0.1379 0.1255 0.1297 0.1278 0.1279
va: 2.1177 2.1409 2.0996 3.1236 3.7485 3.8224 3.8252 3.9058 3.9044 3.8639 4.2825 3.7414 3.9349 3.9385 3.8244 3.6496 4.0306 4.0623 4.0248 3.8460 3.9816 3.9325 3.8515 3.9732 4.0201 3.9429 3.9420 3.9413 1.0239 1.0334 1.0186 1.0035 1.0033 1.0020 1.0070 1.0059 1.0129 0.9989 1.0104 1.0037 0.9991 0.9983 1.0106 1.0192 1.0339 1.0144 1.0014 1.0074 1.0020 1.0107 0.9995 0.9994 0.9998
dispcorr: -0.026188488 hartree
energy: -1210.108237516379
dipole: 32.11261 -30.74903 1.36358 19.15453 -19.54696 -0.39243 -7.21480 5.92650 -1.28830
magnitude: 1.91652 au
magnitude: 4.87141 debye
