program: Orca
programVersion: 5.0.2
elementType: O O O N C C C C C C C C C C C C C C C C C C C C C C C C H H H H H H H H H H H H H H H H H H H H H H H H H
charge: 0
multiplicity: 1
keywords: wb97x-d3
keywords: def2-TZVPP
keywords: def2/J RIJCOSX
keywords: DEFGRID2
keywords: scfconv7
keywords: smallprint printgap noloewdin
keywords: NOSOSCF
formula: C24H25NO3
InChI: InChI=1/C24H25NO3/c1-16(2)13-20-22(24(20,3)4)23(26)28-21(15-25)17-9-8-12-19(14-17)27-18-10-6-5-7-11-18/h5-14,20-22H,1-4H3
53 atoms
O  0.034042 0.721963 0.940265
O  -0.882544 2.674861 0.342605
O  -1.530423 -3.476346 -2.016559
N  -0.974178 -1.482351 3.205541
C  1.861832 3.138435 -1.08485
C  1.902553 3.808226 0.252803
C  1.483711 2.350436 0.157881
C  0.80762 3.574705 -2.073187
C  3.151417 2.726689 -1.756141
C  3.158711 4.146293 0.946714
C  0.091837 1.982332 0.466758
C  3.437938 5.277111 1.599051
C  2.504918 6.441483 1.736543
C  4.767594 5.465134 2.267213
C  -1.259859 0.208125 1.233759
C  -1.87034 -0.452269 0.022034
C  -1.081592 -0.738401 2.337399
C  -1.39969 -1.688539 -0.403859
C  -2.866829 0.20427 -0.685792
C  -1.952703 -2.27924 -1.531323
C  -3.399741 -0.389295 -1.820417
C  -2.953813 -1.628805 -2.243252
C  -1.105845 -4.453038 -1.157495
C  0.04233 -5.151072 -1.498724
C  -1.819822 -4.781531 -0.01197
C  0.476808 -6.187874 -0.686517
C  -1.366929 -5.811092 0.797109
C  -0.220155 -6.518385 0.465664
H  1.070113 4.480693 0.427219
H  2.217934 1.620623 0.479569
H  1.207049 4.377765 -2.695175
H  0.52998 2.752361 -2.735152
H  -0.09821 3.941376 -1.598332
H  2.959501 1.95565 -2.503774
H  3.603802 3.579699 -2.264622
H  3.890185 2.329436 -1.061679
H  3.930621 3.38288 0.926514
H  2.309891 6.655861 2.79009
H  2.955866 7.343364 1.315258
H  1.545013 6.296733 1.246248
H  5.288516 6.338679 1.867077
H  4.646473 5.639273 3.339357
H  5.41826 4.600828 2.140904
H  -1.917923 1.008176 1.586075
H  -0.617613 -2.195171 0.149468
H  -3.21688 1.174335 -0.360063
H  -4.178285 0.11524 -2.376447
H  -3.374548 -2.101914 -3.12065
H  0.583968 -4.883188 -2.396316
H  -2.719643 -4.240093 0.250294
H  1.371826 -6.733294 -0.954911
H  -1.919517 -6.061767 1.692626
H  0.126621 -7.321479 1.101382
totalener: -1210.08453375 hartree
nucrepener: 2427.12209048 hartree
electener: -3637.20662423 hartree
oneelecener: -6465.37850682 hartree
twoeener: 2828.17188259 hartree
kineticenergy: 1204.76755070 hartree
xcener: -118.590052196662 hartree
chargesum: -0.0000000
charge: -0.264178 -0.394165 -0.298854 -0.004957 0.084090 0.043301 -0.105496 -0.255318 -0.245347 -0.184175 0.368717 -0.053631 -0.235463 -0.200798 0.333040 0.005765 -0.266337 -0.176509 -0.134757 0.208145 -0.094368 -0.197457 0.237705 -0.208218 -0.158062 -0.091966 -0.102630 -0.142464 0.090301 0.075398 0.087279 0.087649 0.098859 0.092537 0.094151 0.072205 0.072364 0.088220 0.086039 0.081828 0.083957 0.086022 0.076536 0.120205 0.128366 0.120673 0.128137 0.128350 0.124813 0.131403 0.125062 0.128037 0.125995
qa: -0.2642 -0.3942 -0.2989 -0.0050 0.0841 0.0433 -0.1055 -0.2553 -0.2453 -0.1842 0.3687 -0.0536 -0.2355 -0.2008 0.3330 0.0058 -0.2663 -0.1765 -0.1348 0.2081 -0.0944 -0.1975 0.2377 -0.2082 -0.1581 -0.0920 -0.1026 -0.1425 0.0903 0.0754 0.0873 0.0876 0.0989 0.0925 0.0942 0.0722 0.0724 0.0882 0.0860 0.0818 0.0840 0.0860 0.0765 0.1202 0.1284 0.1207 0.1281 0.1283 0.1248 0.1314 0.1251 0.1280 0.1260
va: 2.1328 2.1091 2.1115 3.1175 3.7326 3.7943 3.8900 3.9136 3.9178 3.9036 4.2059 3.8325 3.9448 3.9338 3.8233 3.6710 4.0325 3.9812 3.9750 3.8631 3.9513 4.0346 3.8084 4.0422 3.9490 3.9346 3.9546 3.9642 1.0313 1.0385 1.0006 1.0027 1.0213 1.0043 1.0033 1.0113 1.0221 0.9990 0.9993 1.0156 0.9982 0.9984 1.0126 1.0219 1.0158 1.0211 0.9996 1.0116 1.0134 1.0035 0.9990 1.0001 1.0002
dispcorr: -0.024394345 hartree
energy: -1210.108928090243
dipole: 23.81257 -23.31618 0.49639 31.74037 -31.02802 0.71235 -2.47200 1.54075 -0.93125
magnitude: 1.27322 au
magnitude: 3.23626 debye
