program: Orca
programVersion: 5.0.2
elementType: O O O N C C C C C C C C C C C C C C C C C C C C C C C C H H H H H H H H H H H H H H H H H H H H H H H H H
charge: 0
multiplicity: 1
keywords: wb97x-d3
keywords: def2-TZVPP
keywords: def2/J RIJCOSX
keywords: DEFGRID2
keywords: scfconv7
keywords: smallprint printgap noloewdin
keywords: NOSOSCF
formula: C24H25NO3
InChI: InChI=1/C24H25NO3/c1-16(2)13-20-22(24(20,3)4)23(26)28-21(15-25)17-9-8-12-19(14-17)27-18-10-6-5-7-11-18/h5-14,20-22H,1-4H3
53 atoms
O  0.15956 0.894986 0.752688
O  -0.986688 2.811684 0.562113
O  -1.527853 -3.523877 -1.984875
N  -0.275624 -1.483625 3.013362
C  1.446656 3.599412 -1.255529
C  1.595997 4.233122 0.084844
C  1.337858 2.742614 -0.001047
C  0.225117 3.910403 -2.085085
C  2.684226 3.352558 -2.085113
C  2.907418 4.742897 0.5628
C  0.045042 2.204002 0.451981
C  3.413708 4.584016 1.786498
C  2.719896 3.839202 2.885382
C  4.747827 5.159316 2.155121
C  -1.019746 0.219161 1.176988
C  -1.701457 -0.460237 0.014056
C  -0.592216 -0.734155 2.203087
C  -1.279709 -1.711831 -0.415213
C  -2.724278 0.203642 -0.651411
C  -1.901621 -2.309196 -1.50372
C  -3.323535 -0.395571 -1.748697
C  -2.923463 -1.650097 -2.175215
C  -1.081759 -4.488396 -1.121979
C  0.063809 -5.186104 -1.471236
C  -1.775437 -4.801754 0.039915
C  0.516638 -6.207731 -0.64957
C  -1.305272 -5.816593 0.857413
C  -0.160256 -6.523278 0.518473
H  0.729182 4.805623 0.407666
H  2.185306 2.093338 0.185147
H  -0.034201 3.070392 -2.732039
H  -0.64697 4.153241 -1.483494
H  0.432984 4.767905 -2.727652
H  2.521024 2.526992 -2.779348
H  2.932745 4.236422 -2.676106
H  3.55323 3.108073 -1.474666
H  3.481558 5.320082 -0.15682
H  1.722122 3.504194 2.613374
H  3.298638 2.963509 3.189593
H  2.626124 4.469908 3.772467
H  5.215772 5.680013 1.320695
H  4.655351 5.8657 2.983575
H  5.432513 4.376172 2.489966
H  -1.713423 0.923122 1.646236
H  -0.480879 -2.227874 0.104207
H  -3.044717 1.181869 -0.319285
H  -4.122118 0.114581 -2.270259
H  -3.398357 -2.127567 -3.022079
H  0.589982 -4.929447 -2.381171
H  -2.67313 -4.259139 0.307001
H  1.410462 -6.7525 -0.923035
H  -1.841944 -6.056403 1.765503
H  0.200919 -7.31432 1.161246
totalener: -1210.08344454 hartree
nucrepener: 2447.59793904 hartree
electener: -3657.68138358 hartree
oneelecener: -6506.37284911 hartree
twoeener: 2848.69146553 hartree
kineticenergy: 1204.76878122 hartree
xcener: -118.589476179952 hartree
chargesum: -0.0000000
charge: -0.258315 -0.391584 -0.298839 -0.004644 0.122208 -0.007842 -0.144270 -0.262803 -0.268574 -0.242936 0.365976 -0.008235 -0.222809 -0.209168 0.321329 0.008512 -0.262183 -0.167221 -0.148570 0.195622 -0.097539 -0.191084 0.225260 -0.202186 -0.148651 -0.094380 -0.104206 -0.138624 0.107750 0.095195 0.089918 0.099555 0.086010 0.094041 0.090044 0.087527 0.093643 0.082303 0.093030 0.091974 0.078472 0.088217 0.085574 0.123345 0.129125 0.129660 0.128000 0.128439 0.125271 0.130642 0.125186 0.126931 0.125900
qa: -0.2583 -0.3916 -0.2988 -0.0046 0.1222 -0.0078 -0.1443 -0.2628 -0.2686 -0.2429 0.3660 -0.0082 -0.2228 -0.2092 0.3213 0.0085 -0.2622 -0.1672 -0.1486 0.1956 -0.0975 -0.1911 0.2253 -0.2022 -0.1487 -0.0944 -0.1042 -0.1386 0.1078 0.0952 0.0899 0.0996 0.0860 0.0940 0.0900 0.0875 0.0936 0.0823 0.0930 0.0920 0.0785 0.0882 0.0856 0.1233 0.1291 0.1297 0.1280 0.1284 0.1253 0.1306 0.1252 0.1269 0.1259
va: 2.1172 2.1094 2.1092 3.1161 3.7372 3.8055 3.8616 3.9065 3.9091 3.8916 4.1685 3.7476 3.9380 3.9415 3.8190 3.6976 4.0346 3.9786 3.9578 3.8828 3.9541 4.0333 3.8218 4.0398 3.9499 3.9372 3.9574 3.9636 1.0230 1.0290 1.0015 1.0193 1.0028 1.0060 1.0019 1.0054 1.0107 1.0149 1.0012 1.0021 1.0098 0.9992 0.9995 1.0231 1.0162 1.0202 0.9998 1.0114 1.0130 1.0034 0.9990 1.0003 1.0002
dispcorr: -0.025500788 hartree
energy: -1210.108945324436
dipole: 21.27863 -20.95335 0.32528 28.04551 -27.47566 0.56985 -1.01386 0.18429 -0.82958
magnitude: 1.05770 au
magnitude: 2.68846 debye
