program: Orca
programVersion: 5.0.2
elementType: O O O N C C C C C C C C C C C C C C C C C C C C C C C C H H H H H H H H H H H H H H H H H H H H H H H H H
charge: 0
multiplicity: 1
keywords: wb97x-d3
keywords: def2-TZVPP
keywords: def2/J RIJCOSX
keywords: DEFGRID2
keywords: scfconv7
keywords: smallprint printgap noloewdin
keywords: NOSOSCF
formula: C24H25NO3
InChI: InChI=1/C24H25NO3/c1-16(2)13-20-22(24(20,3)4)23(26)28-21(15-25)17-9-8-12-19(14-17)27-18-10-6-5-7-11-18/h5-14,20-22H,1-4H3
53 atoms
O  -0.807662 0.965427 1.177051
O  -0.627491 2.2111 -0.677425
O  -1.735592 -3.170656 -1.593799
N  -3.166225 0.837344 3.494186
C  2.281704 0.931663 -0.586162
C  2.327074 2.377684 -0.23042
C  1.338932 1.474735 0.479808
C  1.746213 0.528266 -1.937853
C  3.357854 0.005435 -0.073036
C  3.457799 2.973971 0.527042
C  -0.102101 1.618878 0.223488
C  3.361348 4.020802 1.347882
C  2.073761 4.734514 1.623171
C  4.559598 4.566652 2.063029
C  -2.212505 0.981461 1.063747
C  -2.761143 -0.159419 0.226462
C  -2.73002 0.896069 2.433379
C  -1.926071 -1.146867 -0.273946
C  -4.12539 -0.193794 -0.021223
C  -2.472319 -2.177664 -1.03077
C  -4.655953 -1.230344 -0.771257
C  -3.838528 -2.224493 -1.277137
C  -0.419748 -3.343595 -1.265463
C  -0.038856 -3.695238 0.022938
C  0.524657 -3.219308 -2.272673
C  1.301686 -3.914766 0.297925
C  1.861972 -3.455223 -1.988318
C  2.255812 -3.797291 -0.703778
H  1.860881 3.031351 -0.963676
H  1.586733 1.190175 1.495752
H  1.291833 -0.463471 -1.897717
H  1.007216 1.224357 -2.328037
H  2.567433 0.482513 -2.65551
H  2.984324 -1.018847 -0.026752
H  4.221109 0.01319 -0.741973
H  3.70694 0.278795 0.922655
H  4.436431 2.528669 0.373689
H  2.15221 5.78791 1.343676
H  1.226636 4.312348 1.087143
H  1.840123 4.715301 2.690481
H  5.466501 4.010303 1.829839
H  4.730655 5.613915 1.80224
H  4.414967 4.535978 3.145731
H  -2.553355 1.930361 0.633649
H  -0.863506 -1.119415 -0.076976
H  -4.77477 0.577228 0.374752
H  -5.719271 -1.264284 -0.96576
H  -4.246009 -3.034887 -1.866532
H  -0.783739 -3.79977 0.801594
H  0.207996 -2.949214 -3.271647
H  1.599741 -4.189823 1.300933
H  2.597993 -3.362499 -2.775823
H  3.299503 -3.977644 -0.484135
totalener: -1210.08169426 hartree
nucrepener: 2557.55307319 hartree
electener: -3767.63476745 hartree
oneelecener: -6725.83106266 hartree
twoeener: 2958.19629521 hartree
kineticenergy: 1204.76471154 hartree
xcener: -118.592128565897 hartree
chargesum: -0.0000000
charge: -0.275323 -0.362949 -0.293233 -0.002544 0.162325 -0.037512 -0.101443 -0.233389 -0.285449 -0.239430 0.295069 -0.002350 -0.225584 -0.209397 0.306791 0.064611 -0.254129 -0.204201 -0.227336 0.309909 -0.065533 -0.226944 0.260528 -0.187043 -0.202510 -0.083166 -0.102944 -0.171348 0.109488 0.087023 0.053328 0.106693 0.089264 0.086927 0.092482 0.088303 0.094812 0.091576 0.076965 0.089331 0.078409 0.087233 0.086507 0.130573 0.113912 0.115438 0.126881 0.125843 0.137254 0.130403 0.131926 0.129301 0.134652
qa: -0.2753 -0.3629 -0.2932 -0.0025 0.1623 -0.0375 -0.1014 -0.2334 -0.2854 -0.2394 0.2951 -0.0024 -0.2256 -0.2094 0.3068 0.0646 -0.2541 -0.2042 -0.2273 0.3099 -0.0655 -0.2269 0.2605 -0.1870 -0.2025 -0.0832 -0.1029 -0.1713 0.1095 0.0870 0.0533 0.1067 0.0893 0.0869 0.0925 0.0883 0.0948 0.0916 0.0770 0.0893 0.0784 0.0872 0.0865 0.1306 0.1139 0.1154 0.1269 0.1258 0.1373 0.1304 0.1319 0.1293 0.1347
va: 2.0938 2.1338 2.1276 3.1250 3.6981 3.8605 3.8187 3.8770 3.9134 3.9001 4.2198 3.7340 3.9442 3.9410 3.7968 3.7355 3.9957 3.9725 4.0704 3.7720 3.9434 4.0461 3.7559 3.9781 3.9847 3.8849 3.8593 3.9093 1.0233 1.0351 1.0190 1.0226 1.0048 1.0153 1.0006 1.0072 1.0099 1.0014 1.0184 1.0008 1.0098 0.9988 0.9992 1.0235 1.0238 1.0121 0.9991 1.0146 1.0028 1.0120 0.9979 0.9991 0.9986
dispcorr: -0.028925595 hartree
energy: -1210.110619853683
dipole: 30.23216 -28.91715 1.31501 15.02913 -15.28392 -0.25479 -0.58941 -0.22600 -0.81541
magnitude: 1.56814 au
magnitude: 3.98591 debye
