program: Orca
programVersion: 5.0.2
elementType: O O O N C C C C C C C C C C C C C C C C C C C C C C C C H H H H H H H H H H H H H H H H H H H H H H H H H
charge: 0
multiplicity: 1
keywords: wb97x-d3
keywords: def2-TZVPP
keywords: def2/J RIJCOSX
keywords: DEFGRID2
keywords: scfconv7
keywords: smallprint printgap noloewdin
keywords: NOSOSCF
formula: C24H25NO3
InChI: InChI=1/C24H25NO3/c1-16(2)13-20-22(24(20,3)4)23(26)28-21(15-25)17-9-8-12-19(14-17)27-18-10-6-5-7-11-18/h5-14,20-22H,1-4H3
53 atoms
O  0.011442 0.828794 0.90985
O  -0.95768 2.734034 0.247573
O  -1.721004 -3.368601 -1.935103
N  -0.849592 -1.314062 3.284573
C  1.746091 3.108471 -1.30895
C  1.756137 3.930069 -0.067479
C  1.408952 2.45361 0.02324
C  0.669633 3.348382 -2.339365
C  3.062577 2.683464 -1.915014
C  3.00989 4.440815 0.543988
C  0.033849 2.066343 0.376443
C  3.19169 4.656248 1.847657
C  2.142973 4.379564 2.880606
C  4.483372 5.198577 2.379154
C  -1.263063 0.325482 1.291933
C  -1.959552 -0.354612 0.139211
C  -1.014091 -0.597354 2.402141
C  -1.488023 -1.576256 -0.32884
C  -3.03966 0.266024 -0.468313
C  -2.123698 -2.187471 -1.400179
C  -3.658953 -0.350084 -1.546465
C  -3.211868 -1.572475 -2.011413
C  -0.992766 -4.254091 -1.187676
C  0.197076 -4.723603 -1.7205
C  -1.452787 -4.71598 0.038624
C  0.93057 -5.670192 -1.020429
C  -0.703889 -5.651583 0.733833
C  0.486949 -6.133474 0.208614
H  0.88979 4.577797 0.043221
H  2.177034 1.802524 0.423805
H  1.011746 4.099334 -3.053788
H  0.453729 2.436016 -2.898012
H  -0.261352 3.704417 -1.906135
H  2.932206 1.784571 -2.51921
H  3.453347 3.466363 -2.568234
H  3.82179 2.469654 -1.163006
H  3.82243 4.678961 -0.136126
H  1.941395 5.27521 3.473041
H  1.199538 4.045059 2.454955
H  2.483398 3.614859 3.583413
H  4.928475 4.51039 3.102107
H  5.212247 5.373343 1.588868
H  4.325235 6.142513 2.906173
H  -1.89499 1.134231 1.671615
H  -0.637886 -2.049196 0.148173
H  -3.388243 1.225429 -0.111229
H  -4.503674 0.125717 -2.0260
H  -3.696689 -2.060865 -2.846417
H  0.537038 -4.352941 -2.678621
H  -2.384944 -4.348488 0.448509
H  1.857379 -6.040385 -1.438243
H  -1.058113 -6.007505 1.691933
H  1.064449 -6.866483 0.75512
totalener: -1210.08397913 hartree
nucrepener: 2459.49523905 hartree
electener: -3669.57921818 hartree
oneelecener: -6530.19038310 hartree
twoeener: 2860.61116493 hartree
kineticenergy: 1204.77087762 hartree
xcener: -118.589837896476 hartree
chargesum: -0.0000000
charge: -0.262566 -0.392172 -0.295890 -0.006307 0.126548 -0.033626 -0.104080 -0.254370 -0.276177 -0.235090 0.353039 -0.001200 -0.227019 -0.210352 0.332123 -0.002567 -0.266633 -0.185083 -0.134725 0.231423 -0.089841 -0.205968 0.239772 -0.199075 -0.169846 -0.095314 -0.099931 -0.138304 0.106879 0.087912 0.085194 0.089898 0.100325 0.093127 0.092639 0.085465 0.095093 0.090210 0.076838 0.092201 0.086716 0.078576 0.087367 0.119020 0.127419 0.117191 0.126467 0.127435 0.123657 0.133327 0.125074 0.128686 0.126518
qa: -0.2626 -0.3922 -0.2959 -0.0063 0.1265 -0.0336 -0.1041 -0.2544 -0.2762 -0.2351 0.3530 -0.0012 -0.2270 -0.2104 0.3321 -0.0026 -0.2666 -0.1851 -0.1347 0.2314 -0.0898 -0.2060 0.2398 -0.1991 -0.1698 -0.0953 -0.0999 -0.1383 0.1069 0.0879 0.0852 0.0899 0.1003 0.0931 0.0926 0.0855 0.0951 0.0902 0.0768 0.0922 0.0867 0.0786 0.0874 0.1190 0.1274 0.1172 0.1265 0.1274 0.1237 0.1333 0.1251 0.1287 0.1265
va: 2.1279 2.1073 2.1161 3.1207 3.7494 3.8378 3.8259 3.8979 3.9134 3.8923 4.1841 3.7351 3.9450 3.9415 3.8289 3.6852 4.0320 3.9770 3.9804 3.8510 3.9559 4.0324 3.8012 4.0458 3.9726 3.9312 3.9449 3.9582 1.0236 1.0329 1.0024 1.0017 1.0196 1.0066 1.0005 1.0046 1.0094 1.0018 1.0183 1.0004 0.9989 1.0097 0.9988 1.0210 1.0177 1.0216 0.9999 1.0125 1.0133 1.0032 0.9992 0.9998 1.0003
dispcorr: -0.025345965 hartree
energy: -1210.109325095840
dipole: 22.96094 -22.40772 0.55322 26.80281 -26.28696 0.51585 -1.17547 0.34465 -0.83083
magnitude: 1.12358 au
magnitude: 2.85591 debye
