program: Orca
programVersion: 5.0.2
elementType: O O O N C C C C C C C C C C C C C C C C C C C C C C C C H H H H H H H H H H H H H H H H H H H H H H H H H
charge: 0
multiplicity: 1
keywords: wb97x-d3
keywords: def2-TZVPP
keywords: def2/J RIJCOSX
keywords: DEFGRID2
keywords: scfconv7
keywords: smallprint printgap noloewdin
keywords: NOSOSCF
formula: C24H25NO3
InChI: InChI=1/C24H25NO3/c1-16(2)13-20-22(24(20,3)4)23(26)28-21(15-25)17-9-8-12-19(14-17)27-18-10-6-5-7-11-18/h5-14,20-22H,1-4H3
53 atoms
O  0.165791 0.921067 0.672848
O  -0.996782 2.837192 0.615426
O  -1.561195 -3.575798 -1.978013
N  -0.167482 -1.467282 2.943522
C  1.373135 3.731559 -1.236591
C  1.556203 4.301533 0.127332
C  1.30798 2.813323 -0.023269
C  0.124477 4.068507 -2.014088
C  2.587532 3.540628 -2.113843
C  2.877206 4.793895 0.597452
C  0.034299 2.242761 0.443692
C  3.379198 4.628574 1.822047
C  2.66826 3.896026 2.918062
C  4.723017 5.178706 2.193037
C  -0.987252 0.215595 1.120729
C  -1.677854 -0.477038 -0.029234
C  -0.518322 -0.727042 2.138434
C  -1.278292 -1.742589 -0.437789
C  -2.692511 0.19166 -0.702768
C  -1.913498 -2.34809 -1.514567
C  -3.305394 -0.41622 -1.787391
C  -2.927115 -1.684246 -2.193587
C  -1.118301 -4.532332 -1.104527
C  0.021457 -5.241934 -1.448424
C  -1.810945 -4.827262 0.062643
C  0.469599 -6.256815 -0.615928
C  -1.345814 -5.83592 0.890655
C  -0.20661 -6.554303 0.557091
H  0.694343 4.848216 0.503538
H  2.166596 2.16552 0.108487
H  -0.730418 4.275841 -1.375641
H  0.305293 4.955716 -2.623617
H  -0.147394 3.25552 -2.689763
H  2.405508 2.760585 -2.854462
H  2.818639 4.460966 -2.654124
H  3.473623 3.259265 -1.54534
H  3.461288 5.35853 -0.123917
H  3.233395 3.013412 3.22784
H  2.576464 4.529883 3.803196
H  1.668071 3.573116 2.639302
H  5.199545 5.696097 1.361392
H  4.643991 5.881354 3.026012
H  5.393793 4.381284 2.522289
H  -1.687609 0.903519 1.603603
H  -0.486305 -2.262965 0.087733
H  -2.997227 1.179774 -0.384829
H  -4.098326 0.097286 -2.314235
H  -3.41298 -2.16892 -3.030087
H  0.546696 -4.999937 -2.362806
H  -2.704507 -4.275635 0.324954
H  1.358667 -6.811188 -0.885261
H  -1.881911 -6.062022 1.802512
H  0.150692 -7.340485 1.207966
totalener: -1210.08352154 hartree
nucrepener: 2442.34054852 hartree
electener: -3652.42407006 hartree
oneelecener: -6495.85444786 hartree
twoeener: 2843.43037781 hartree
kineticenergy: 1204.76730753 hartree
xcener: -118.589239208543 hartree
chargesum: -0.0000000
charge: -0.257576 -0.391838 -0.298596 -0.005356 0.125454 -0.014792 -0.135342 -0.262665 -0.270447 -0.240235 0.363045 -0.007470 -0.222850 -0.209273 0.316582 0.010035 -0.258309 -0.168817 -0.151828 0.196101 -0.098696 -0.190134 0.223880 -0.200800 -0.147666 -0.094782 -0.104371 -0.137665 0.108517 0.093006 0.099928 0.086071 0.089788 0.093289 0.090716 0.087777 0.093465 0.093035 0.091579 0.080124 0.078480 0.087917 0.086007 0.124037 0.129790 0.131352 0.128098 0.128408 0.125280 0.130180 0.125075 0.126718 0.125778
qa: -0.2576 -0.3918 -0.2986 -0.0054 0.1255 -0.0148 -0.1353 -0.2627 -0.2704 -0.2402 0.3630 -0.0075 -0.2229 -0.2093 0.3166 0.0100 -0.2583 -0.1688 -0.1518 0.1961 -0.0987 -0.1901 0.2239 -0.2008 -0.1477 -0.0948 -0.1044 -0.1377 0.1085 0.0930 0.0999 0.0861 0.0898 0.0933 0.0907 0.0878 0.0935 0.0930 0.0916 0.0801 0.0785 0.0879 0.0860 0.1240 0.1298 0.1314 0.1281 0.1284 0.1253 0.1302 0.1251 0.1267 0.1258
va: 2.1167 2.1086 2.1088 3.1154 3.7349 3.8141 3.8495 3.9049 3.9106 3.8920 4.1734 3.7437 3.9399 3.9415 3.8194 3.7107 4.0334 3.9790 3.9550 3.8874 3.9553 4.0327 3.8232 4.0389 3.9513 3.9373 3.9572 3.9636 1.0228 1.0301 1.0189 1.0029 1.0017 1.0063 1.0014 1.0051 1.0103 1.0010 1.0020 1.0162 1.0097 0.9992 0.9993 1.0244 1.0166 1.0192 1.0000 1.0115 1.0129 1.0035 0.9991 1.0003 1.0002
dispcorr: -0.025394404 hartree
energy: -1210.108915945310
dipole: 20.70639 -20.42046 0.28593 28.72389 -28.15542 0.56847 -0.66377 -0.16913 -0.83290
magnitude: 1.04816 au
magnitude: 2.66421 debye
