program: Orca
programVersion: 5.0.2
elementType: O O O N C C C C C C C C C C C C C C C C C C C C C C C C H H H H H H H H H H H H H H H H H H H H H H H H H
charge: 0
multiplicity: 1
keywords: wb97x-d3
keywords: def2-TZVPP
keywords: def2/J RIJCOSX
keywords: DEFGRID2
keywords: scfconv7
keywords: smallprint printgap noloewdin
keywords: NOSOSCF
formula: C24H25NO3
InChI: InChI=1/C24H25NO3/c1-16(2)13-20-22(24(20,3)4)23(26)28-21(15-25)17-9-8-12-19(14-17)27-18-10-6-5-7-11-18/h5-14,20-22H,1-4H3
53 atoms
O  -1.095163 1.934435 -0.468814
O  0.127332 0.762372 -1.930356
O  -1.023725 -3.589321 0.134903
N  -4.338717 2.547429 -0.284072
C  1.341848 3.751738 -0.10026
C  1.316752 2.695218 0.949685
C  1.238547 2.296417 -0.520224
C  0.171647 4.697853 -0.226498
C  2.658837 4.409213 -0.44427
C  2.502313 2.310942 1.755222
C  0.065324 1.595902 -1.067604
C  2.66433 1.125921 2.346656
C  1.670409 0.008778 2.243251
C  3.878438 0.825262 3.172295
C  -2.214688 1.089347 -0.714012
C  -2.147467 -0.106698 0.204301
C  -3.399047 1.913779 -0.469646
C  -1.668594 -1.307805 -0.298191
C  -2.453655 0.021917 1.554166
C  -1.471503 -2.381176 0.562482
C  -2.27584 -1.062668 2.396481
C  -1.775728 -2.260375 1.911316
C  -0.098528 -3.677951 -0.868452
C  -0.236029 -4.736186 -1.754906
C  0.969231 -2.796377 -0.98088
C  0.704637 -4.914908 -2.757017
C  1.894484 -2.980146 -1.996703
C  1.770478 -4.036944 -2.886187
H  0.367934 2.613867 1.472375
H  2.150355 1.885774 -0.937533
H  -0.768086 4.271655 0.113021
H  0.362191 5.589053 0.373953
H  0.040682 5.021936 -1.260261
H  2.627309 4.819885 -1.45441
H  2.866412 5.233029 0.241322
H  3.49981 3.717768 -0.396685
H  3.274693 3.06272 1.88762
H  0.806534 0.248882 1.626042
H  2.141145 -0.886461 1.827814
H  1.29883 -0.273157 3.231407
H  3.603854 0.580149 4.201086
H  4.414737 -0.04192 2.779312
H  4.572345 1.664242 3.202508
H  -2.23722 0.767838 -1.759424
H  -1.429371 -1.397228 -1.349868
H  -2.835865 0.956074 1.945918
H  -2.518412 -0.973674 3.446823
H  -1.62477 -3.106114 2.568969
H  -1.073807 -5.413043 -1.651473
H  1.0811 -1.968063 -0.293199
H  0.595888 -5.742729 -3.445038
H  2.719306 -2.286528 -2.089164
H  2.497863 -4.174332 -3.674454
totalener: -1210.07894738 hartree
nucrepener: 2585.51375262 hartree
electener: -3795.59270000 hartree
oneelecener: -6781.74722337 hartree
twoeener: 2986.15452337 hartree
kineticenergy: 1204.76891993 hartree
xcener: -118.590467920829 hartree
chargesum: -0.0000000
charge: -0.261727 -0.359866 -0.296850 -0.001530 0.141040 -0.006102 -0.091536 -0.246933 -0.283831 -0.243029 0.322500 0.000334 -0.177428 -0.213557 0.298797 0.005791 -0.270768 -0.154134 -0.172168 0.248282 -0.102861 -0.201621 0.239719 -0.204360 -0.116041 -0.097913 -0.124239 -0.132983 0.097938 0.085710 0.094186 0.084560 0.092612 0.095330 0.095013 0.082638 0.095741 0.017472 0.082428 0.093735 0.087962 0.087335 0.079494 0.122826 0.136394 0.118189 0.129158 0.127178 0.125299 0.100937 0.125160 0.121138 0.124582
qa: -0.2617 -0.3599 -0.2968 -0.0015 0.1410 -0.0061 -0.0915 -0.2469 -0.2838 -0.2430 0.3225 0.0003 -0.1774 -0.2136 0.2988 0.0058 -0.2708 -0.1541 -0.1722 0.2483 -0.1029 -0.2016 0.2397 -0.2044 -0.1160 -0.0979 -0.1242 -0.1330 0.0979 0.0857 0.0942 0.0846 0.0926 0.0953 0.0950 0.0826 0.0957 0.0175 0.0824 0.0937 0.0880 0.0873 0.0795 0.1228 0.1364 0.1182 0.1292 0.1272 0.1253 0.1009 0.1252 0.1211 0.1246
va: 2.0925 2.1335 2.1225 3.1126 3.7334 3.7956 3.8181 3.8986 3.9245 3.8886 4.2063 3.7782 3.9378 3.9386 3.8715 3.6253 4.0150 3.9053 3.9833 3.8489 3.9372 4.0221 3.7934 4.0253 3.9223 3.9417 3.9956 3.9544 1.0237 1.0281 1.0141 1.0029 1.0031 1.0060 0.9997 1.0047 1.0102 1.0329 1.0028 1.0055 0.9983 0.9993 1.0098 1.0190 1.0177 1.0181 0.9994 1.0127 1.0140 1.0104 0.9991 1.0022 1.0002
dispcorr: -0.029791369 hartree
energy: -1210.108738745491
dipole: 25.03761 -23.53619 1.50142 13.70638 -13.99028 -0.28390 10.25136 -9.70461 0.54675
magnitude: 1.62290 au
magnitude: 4.12508 debye
