program: Orca
programVersion: 5.0.2
elementType: O O O N C C C C C C C C C C C C C C C C C C C C C C C C H H H H H H H H H H H H H H H H H H H H H H H H H
charge: 0
multiplicity: 1
keywords: wb97x-d3
keywords: def2-TZVPP
keywords: def2/J RIJCOSX
keywords: DEFGRID2
keywords: scfconv7
keywords: smallprint printgap noloewdin
keywords: NOSOSCF
formula: C24H25NO3
InChI: InChI=1/C24H25NO3/c1-16(2)13-20-22(24(20,3)4)23(26)28-21(15-25)17-9-8-12-19(14-17)27-18-10-6-5-7-11-18/h5-14,20-22H,1-4H3
53 atoms
O  -1.083746 1.386141 -0.369578
O  -1.062766 3.370146 0.655637
O  -1.384093 -3.649913 -0.82459
N  -1.911022 0.832299 2.877928
C  1.589706 3.938653 -0.893898
C  1.982412 3.060915 0.245875
C  0.823042 2.656066 -0.658529
C  0.968611 5.284467 -0.606261
C  2.455905 3.94014 -2.132735
C  3.228659 2.251911 0.240151
C  -0.517966 2.575284 -0.058884
C  3.327366 0.980494 0.633189
C  2.174145 0.170924 1.144309
C  4.635419 0.25023 0.581707
C  -2.285793 1.049729 0.294537
C  -2.734641 -0.298781 -0.213278
C  -2.064257 0.962342 1.746747
C  -1.807807 -1.332612 -0.289245
C  -4.05928 -0.509718 -0.552781
C  -2.221703 -2.58833 -0.70357
C  -4.460569 -1.77254 -0.9711
C  -3.553386 -2.810993 -1.046649
C  -0.134849 -3.600324 -0.264174
C  0.025374 -3.565068 1.114737
C  0.966102 -3.635504 -1.104687
C  1.304064 -3.569432 1.649132
C  2.241659 -3.648287 -0.557429
C  2.415015 -3.612956 0.817735
H  1.666614 3.427682 1.2204
H  1.046973 1.847103 -1.344068
H  0.286847 5.578454 -1.406487
H  0.414078 5.308008 0.327724
H  1.754771 6.04019 -0.550457
H  3.285734 4.640308 -2.018126
H  2.878332 2.958961 -2.349589
H  1.877329 4.254042 -3.002921
H  4.127618 2.758547 -0.100749
H  1.921628 -0.63267 0.446582
H  2.437891 -0.317235 2.084912
H  1.27853 0.759075 1.325793
H  4.940647 -0.076355 1.578995
H  4.550833 -0.653149 -0.028574
H  5.43558 0.863282 0.168797
H  -3.060021 1.80328 0.116937
H  -0.773956 -1.152459 -0.024754
H  -4.777825 0.297482 -0.490728
H  -5.494069 -1.947709 -1.237562
H  -3.861854 -3.796382 -1.369912
H  -0.840974 -3.536468 1.763198
H  0.819993 -3.664001 -2.176471
H  1.430256 -3.541977 2.723184
H  3.101842 -3.684534 -1.212733
H  3.410213 -3.620445 1.241348
totalener: -1210.07963081 hartree
nucrepener: 2566.50411316 hartree
electener: -3776.58374397 hartree
oneelecener: -6744.02806312 hartree
twoeener: 2967.44431915 hartree
kineticenergy: 1204.76113578 hartree
xcener: -118.588431759054 hartree
chargesum: -0.0000000
charge: -0.270245 -0.357607 -0.294133 -0.005375 0.152607 -0.023564 -0.139811 -0.256509 -0.271354 -0.232797 0.319802 0.012310 -0.214363 -0.222050 0.321318 0.033685 -0.261080 -0.142950 -0.178161 0.241154 -0.076403 -0.214703 0.218017 -0.155989 -0.163654 -0.111800 -0.103250 -0.152033 0.113932 0.089572 0.085054 0.103045 0.081780 0.091581 0.086003 0.092151 0.094074 0.073552 0.094992 0.082130 0.089177 0.077628 0.082073 0.108478 0.091497 0.111372 0.126247 0.126919 0.136171 0.126675 0.131790 0.126231 0.126814
qa: -0.2702 -0.3576 -0.2941 -0.0054 0.1526 -0.0236 -0.1398 -0.2565 -0.2714 -0.2328 0.3198 0.0123 -0.2144 -0.2221 0.3213 0.0337 -0.2611 -0.1430 -0.1782 0.2412 -0.0764 -0.2147 0.2180 -0.1560 -0.1637 -0.1118 -0.1033 -0.1520 0.1139 0.0896 0.0851 0.1030 0.0818 0.0916 0.0860 0.0922 0.0941 0.0736 0.0950 0.0821 0.0892 0.0776 0.0821 0.1085 0.0915 0.1114 0.1262 0.1269 0.1362 0.1267 0.1318 0.1262 0.1268
va: 2.1284 2.1362 2.1202 3.1114 3.7194 3.8405 3.8589 3.9020 3.9084 3.8847 4.2092 3.7134 3.9538 3.9455 3.8685 3.7755 3.9724 3.9504 4.0073 3.8462 3.9652 4.0383 3.8252 3.9718 4.0206 3.8909 3.8954 3.8953 1.0180 1.0292 1.0031 1.0216 1.0016 1.0020 1.0051 1.0066 1.0094 0.9980 1.0035 1.0238 0.9987 1.0009 1.0119 1.0213 1.0420 1.0128 1.0000 1.0137 1.0030 1.0110 0.9998 1.0001 1.0021
dispcorr: -0.029316905 hartree
energy: -1210.108947720029
dipole: 26.29490 -25.61429 0.68062 13.23280 -13.75803 -0.52523 -4.56059 3.16919 -1.39140
magnitude: 1.63557 au
magnitude: 4.15730 debye
