program: Orca
programVersion: 5.0.2
elementType: O O O N C C C C C C C C C C C C C C C C C C C C C C C C H H H H H H H H H H H H H H H H H H H H H H H H H
charge: 0
multiplicity: 1
keywords: wb97x-d3
keywords: def2-TZVPP
keywords: def2/J RIJCOSX
keywords: DEFGRID2
keywords: scfconv7
keywords: smallprint printgap noloewdin
keywords: NOSOSCF
formula: C24H25NO3
InChI: InChI=1/C24H25NO3/c1-16(2)13-20-22(24(20,3)4)23(26)28-21(15-25)17-9-8-12-19(14-17)27-18-10-6-5-7-11-18/h5-14,20-22H,1-4H3
53 atoms
O  0.152118 1.137075 -0.340093
O  1.753915 0.954874 1.220308
O  -2.897052 -4.069967 0.081596
N  0.928308 -0.807182 -2.948312
C  0.966087 3.916947 1.869554
C  2.161497 3.915233 0.969563
C  0.939456 3.113293 0.578476
C  1.058224 3.227943 3.208523
C  0.084703 5.142319 1.889724
C  2.545259 5.090454 0.151034
C  1.026252 1.643191 0.561731
C  3.556348 5.917147 0.420566
C  4.442241 5.780833 1.621184
C  3.883033 7.067295 -0.4832
C  0.116107 -0.261359 -0.521494
C  -1.282703 -0.806001 -0.324102
C  0.574743 -0.550503 -1.885958
C  -1.420763 -2.181958 -0.195619
C  -2.394812 0.019963 -0.301423
C  -2.68581 -2.737597 -0.067496
C  -3.651825 -0.547698 -0.142255
C  -3.807465 -1.917111 -0.034275
C  -2.045496 -4.979193 -0.483429
C  -1.605446 -4.861347 -1.796227
C  -1.679263 -6.070755 0.28907
C  -0.783075 -5.843547 -2.325371
C  -0.86771 -7.05303 -0.258244
C  -0.411674 -6.941759 -1.562965
H  2.984266 3.302191 1.325345
H  0.324127 3.5317 -0.210553
H  0.082349 2.855548 3.525395
H  1.75277 2.39216 3.211789
H  1.394324 3.944185 3.960271
H  -0.008236 5.610856 0.910987
H  -0.918175 4.890186 2.23794
H  0.496082 5.890832 2.568807
H  1.954227 5.27919 -0.740319
H  4.413198 6.693177 2.22268
H  4.165105 4.952318 2.270073
H  5.484411 5.640092 1.322218
H  4.900027 6.982117 -0.874018
H  3.204162 7.128846 -1.332785
H  3.835892 8.016764 0.055875
H  0.80368 -0.754696 0.173597
H  -0.543093 -2.81806 -0.204387
H  -2.293861 1.090306 -0.404862
H  -4.526095 0.088887 -0.116808
H  -4.788159 -2.360054 0.077277
H  -1.897809 -4.013463 -2.402482
H  -2.03554 -6.147694 1.307973
H  -0.435867 -5.748054 -3.345551
H  -0.585584 -7.905936 0.344741
H  0.227162 -7.705684 -1.984633
totalener: -1210.08228262 hartree
nucrepener: 2381.78736546 hartree
electener: -3591.86964808 hartree
oneelecener: -6374.51179784 hartree
twoeener: 2782.64214975 hartree
kineticenergy: 1204.76622580 hartree
xcener: -118.590361410856 hartree
chargesum: -0.0000000
charge: -0.292934 -0.377077 -0.296363 -0.005731 0.144339 -0.022258 -0.166089 -0.273516 -0.234053 -0.187734 0.372443 -0.027427 -0.235581 -0.211400 0.322159 0.096876 -0.256340 -0.233674 -0.198285 0.247308 -0.079188 -0.208895 0.258414 -0.183272 -0.215290 -0.105032 -0.088045 -0.146222 0.104496 0.077639 0.088678 0.104455 0.085137 0.078192 0.092296 0.089676 0.086596 0.085110 0.080775 0.091880 0.088116 0.079458 0.083963 0.133788 0.123891 0.125541 0.126111 0.127971 0.138317 0.125417 0.132035 0.126275 0.127050
qa: -0.2929 -0.3771 -0.2964 -0.0057 0.1443 -0.0223 -0.1661 -0.2735 -0.2341 -0.1877 0.3724 -0.0274 -0.2356 -0.2114 0.3222 0.0969 -0.2563 -0.2337 -0.1983 0.2473 -0.0792 -0.2089 0.2584 -0.1833 -0.2153 -0.1050 -0.0880 -0.1462 0.1045 0.0776 0.0887 0.1045 0.0851 0.0782 0.0923 0.0897 0.0866 0.0851 0.0808 0.0919 0.0881 0.0795 0.0840 0.1338 0.1239 0.1255 0.1261 0.1280 0.1383 0.1254 0.1320 0.1263 0.1270
va: 2.1019 2.1346 2.1194 3.1210 3.6749 3.8142 3.9557 3.9118 3.9078 3.8842 4.1932 3.7530 3.9480 3.9406 3.7556 3.7122 3.9958 3.9947 4.0190 3.8540 3.9421 4.0410 3.7798 3.9556 4.0473 3.9437 3.9283 3.9631 1.0223 1.0394 1.0026 1.0193 1.0019 1.0081 1.0050 1.0063 1.0158 1.0000 1.0114 1.0002 0.9978 1.0112 0.9987 1.0387 1.0131 1.0209 1.0002 1.0123 1.0027 1.0138 0.9989 0.9987 1.0002
dispcorr: -0.024146287 hartree
energy: -1210.106428911898
dipole: 16.87507 -17.28751 -0.41244 38.32724 -37.38458 0.94266 12.89694 -11.91501 0.98193
magnitude: 1.42229 au
magnitude: 3.61517 debye
