program: Orca
programVersion: 5.0.2
elementType: O O O N C C C C C C C C C C C C C C C C C C C C C C C C H H H H H H H H H H H H H H H H H H H H H H H H H
charge: 0
multiplicity: 1
keywords: wb97x-d3
keywords: def2-TZVPP
keywords: def2/J RIJCOSX
keywords: DEFGRID2
keywords: scfconv7
keywords: smallprint printgap noloewdin
keywords: NOSOSCF
formula: C24H25NO3
InChI: InChI=1/C24H25NO3/c1-16(2)13-20-22(24(20,3)4)23(26)28-21(15-25)17-9-8-12-19(14-17)27-18-10-6-5-7-11-18/h5-14,20-22H,1-4H3
53 atoms
O  -0.830351 1.824631 -0.2249
O  0.540636 0.521332 -1.414091
O  -1.31036 -3.908128 -0.083204
N  -4.082156 2.304721 -0.028159
C  1.457465 3.888439 -0.334334
C  1.378814 3.222663 0.996471
C  1.465337 2.369364 -0.259075
C  0.254781 4.641579 -0.85137
C  2.766082 4.504181 -0.771959
C  2.49865 3.228093 1.970419
C  0.380488 1.479021 -0.70748
C  2.679636 2.314677 2.92535
C  1.781715 1.130448 3.113395
C  3.814855 2.418732 3.897609
C  -1.906663 0.944325 -0.521077
C  -1.833076 -0.308768 0.31725
C  -3.120913 1.713784 -0.240882
C  -1.634923 -1.528617 -0.307329
C  -1.900927 -0.224832 1.70256
C  -1.483749 -2.676394 0.461025
C  -1.763488 -1.377384 2.457816
C  -1.546457 -2.601429 1.845467
C  -0.591933 -4.080088 -1.233526
C  -1.018877 -5.088012 -2.08627
C  0.544826 -3.338312 -1.530842
C  -0.30034 -5.358778 -3.239787
C  1.245904 -3.613453 -2.69507
C  0.831708 -4.621032 -3.552957
H  0.389622 3.245226 1.444692
H  2.431669 1.919231 -0.454222
H  -0.688101 4.270579 -0.458324
H  0.334571 5.691379 -0.563632
H  0.206236 4.604137 -1.941112
H  2.865182 5.517927 -0.378634
H  3.631859 3.932526 -0.438585
H  2.81265 4.566774 -1.860133
H  3.196873 4.05774 1.912896
H  1.321909 1.148703 4.105239
H  0.981952 1.071382 2.37734
H  2.352716 0.200287 3.055572
H  3.447232 2.489718 4.924347
H  4.450651 1.530864 3.85579
H  4.440307 3.289407 3.705149
H  -1.911619 0.682392 -1.584021
H  -1.57279 -1.578165 -1.386672
H  -2.063496 0.72858 2.189381
H  -1.816947 -1.324096 3.536809
H  -1.427696 -3.502363 2.432671
H  -1.905041 -5.656879 -1.837385
H  0.882774 -2.546009 -0.875731
H  -0.63478 -6.14772 -3.900329
H  2.126081 -3.029072 -2.92741
H  1.386932 -4.829815 -4.457225
totalener: -1210.07958345 hartree
nucrepener: 2521.77245171 hartree
electener: -3731.85203516 hartree
oneelecener: -6654.40745515 hartree
twoeener: 2922.55541999 hartree
kineticenergy: 1204.77442082 hartree
xcener: -118.590946467168 hartree
chargesum: -0.0000000
charge: -0.265564 -0.363250 -0.296662 0.001487 0.136306 -0.006599 -0.108111 -0.253470 -0.285212 -0.244088 0.350877 -0.010705 -0.186876 -0.212674 0.297428 0.071361 -0.269853 -0.163496 -0.257759 0.256418 -0.072237 -0.203824 0.272599 -0.228186 -0.176007 -0.082712 -0.106634 -0.151438 0.100415 0.086503 0.094821 0.086072 0.093086 0.094464 0.083751 0.094963 0.095848 0.088473 0.044118 0.087584 0.087295 0.086163 0.079086 0.117711 0.122902 0.126200 0.128072 0.127895 0.124115 0.131308 0.124768 0.128444 0.124823
qa: -0.2656 -0.3633 -0.2967 0.0015 0.1363 -0.0066 -0.1081 -0.2535 -0.2852 -0.2441 0.3509 -0.0107 -0.1869 -0.2127 0.2974 0.0714 -0.2699 -0.1635 -0.2578 0.2564 -0.0722 -0.2038 0.2726 -0.2282 -0.1760 -0.0827 -0.1066 -0.1514 0.1004 0.0865 0.0948 0.0861 0.0931 0.0945 0.0838 0.0950 0.0958 0.0885 0.0441 0.0876 0.0873 0.0862 0.0791 0.1177 0.1229 0.1262 0.1281 0.1279 0.1241 0.1313 0.1248 0.1284 0.1248
va: 2.1021 2.1426 2.1208 3.1163 3.7264 3.8061 3.8383 3.9030 3.9253 3.8900 4.1929 3.7719 3.9383 3.9415 3.8866 3.5631 4.0140 3.9439 4.0112 3.8574 3.9140 4.0505 3.7764 4.0479 3.9395 3.9270 3.9500 3.9641 1.0214 1.0295 1.0117 1.0038 1.0016 0.9997 1.0046 1.0058 1.0098 1.0019 1.0268 1.0041 0.9982 0.9991 1.0101 1.0186 1.0168 1.0149 0.9992 1.0118 1.0149 1.0127 0.9989 0.9999 1.0004
dispcorr: -0.027549331 hartree
energy: -1210.107132779740
dipole: 24.21485 -22.76175 1.45311 19.55290 -19.59457 -0.04166 9.87250 -9.55013 0.32237
magnitude: 1.48902 au
magnitude: 3.78479 debye
