program: Orca
programVersion: 5.0.2
elementType: O O O N C C C C C C C C C C C C C C C C C C C C C C C C H H H H H H H H H H H H H H H H H H H H H H H H H
charge: 0
multiplicity: 1
keywords: wb97x-d3
keywords: def2-TZVPP
keywords: def2/J RIJCOSX
keywords: DEFGRID2
keywords: scfconv7
keywords: smallprint printgap noloewdin
keywords: NOSOSCF
formula: C24H25NO3
InChI: InChI=1/C24H25NO3/c1-16(2)13-20-22(24(20,3)4)23(26)28-21(15-25)17-9-8-12-19(14-17)27-18-10-6-5-7-11-18/h5-14,20-22H,1-4H3
53 atoms
O  -0.403874 1.221964 1.381259
O  -0.670235 2.628615 -0.337866
O  -0.212959 -3.606851 -0.39479
N  -2.57182 -0.180032 3.457558
C  2.462247 2.665538 -0.316027
C  1.962015 3.872096 0.415019
C  1.438445 2.498508 0.794409
C  2.066113 2.49143 -1.762339
C  3.843033 2.128543 -0.020901
C  2.779393 4.623643 1.384577
C  0.032212 2.161169 0.516947
C  2.867384 5.950668 1.501389
C  2.138067 6.938721 0.642721
C  3.74384 6.567602 2.550438
C  -1.716666 0.72665 1.161052
C  -1.721592 -0.357255 0.111253
C  -2.178837 0.221839 2.45613
C  -0.998357 -1.523013 0.329151
C  -2.422745 -0.178039 -1.070494
C  -0.979028 -2.510363 -0.641934
C  -2.402271 -1.176659 -2.033204
C  -1.683272 -2.341531 -1.83046
C  -0.628227 -4.833412 -0.832901
C  0.30823 -5.645942 -1.453108
C  -1.926175 -5.281766 -0.622098
C  -0.058425 -6.91918 -1.862805
C  -2.281486 -6.5522 -1.046082
C  -1.353214 -7.37544 -1.667809
H  1.247477 4.457914 -0.152356
H  1.823957 2.073141 1.714199
H  1.103439 2.936979 -1.997959
H  2.816681 2.961614 -2.400361
H  2.020739 1.434314 -2.031022
H  3.916203 1.083938 -0.327403
H  4.596415 2.69226 -0.573474
H  4.106418 2.177334 1.034612
H  3.363405 4.025795 2.077934
H  1.513471 6.481721 -0.120663
H  1.497612 7.579878 1.253146
H  2.844705 7.600261 0.135879
H  3.161392 7.197714 3.227151
H  4.257173 5.818058 3.151422
H  4.50202 7.212984 2.09981
H  -2.390197 1.534881 0.859036
H  -0.450122 -1.676601 1.250856
H  -2.970725 0.73811 -1.245789
H  -2.943657 -1.041877 -2.959843
H  -1.667164 -3.110284 -2.592013
H  1.315416 -5.280649 -1.605026
H  -2.650702 -4.648842 -0.125681
H  0.673714 -7.553885 -2.344094
H  -3.291667 -6.902226 -0.880122
H  -1.636725 -8.366993 -1.993414
totalener: -1210.08381875 hartree
nucrepener: 2401.29222531 hartree
electener: -3611.37604406 hartree
oneelecener: -6413.58099989 hartree
twoeener: 2802.20495583 hartree
kineticenergy: 1204.77560820 hartree
xcener: -118.590436798108 hartree
chargesum: -0.0000000
charge: -0.267858 -0.385064 -0.297786 -0.003004 0.084194 0.040524 -0.096451 -0.253348 -0.247917 -0.183422 0.350718 -0.053027 -0.236048 -0.201184 0.338678 0.009237 -0.265521 -0.194734 -0.121957 0.180385 -0.112498 -0.142564 0.214055 -0.195316 -0.142806 -0.099781 -0.121398 -0.135737 0.089719 0.075686 0.099318 0.087257 0.087608 0.092924 0.094337 0.073013 0.071928 0.082727 0.087737 0.086050 0.085340 0.077129 0.084229 0.117135 0.122801 0.114359 0.129687 0.134827 0.126391 0.137351 0.126415 0.129183 0.126482
qa: -0.2679 -0.3851 -0.2978 -0.0030 0.0842 0.0405 -0.0965 -0.2533 -0.2479 -0.1834 0.3507 -0.0530 -0.2360 -0.2012 0.3387 0.0092 -0.2655 -0.1947 -0.1220 0.1804 -0.1125 -0.1426 0.2141 -0.1953 -0.1428 -0.0998 -0.1214 -0.1357 0.0897 0.0757 0.0993 0.0873 0.0876 0.0929 0.0943 0.0730 0.0719 0.0827 0.0877 0.0860 0.0853 0.0771 0.0842 0.1171 0.1228 0.1144 0.1297 0.1348 0.1264 0.1374 0.1264 0.1292 0.1265
va: 2.1300 2.1204 2.1035 3.1214 3.7368 3.8019 3.8825 3.9124 3.9177 3.9053 4.2205 3.8302 3.9447 3.9341 3.8191 3.6713 4.0324 4.0818 3.9922 3.9035 3.9628 3.9359 3.8273 4.0304 3.9373 3.9403 3.9476 3.9534 1.0320 1.0381 1.0213 1.0007 1.0028 1.0043 1.0035 1.0109 1.0222 1.0156 0.9990 0.9995 0.9984 1.0124 0.9982 1.0208 1.0293 1.0174 1.0011 1.0029 1.0128 1.0020 0.9989 0.9997 1.0001
dispcorr: -0.024112554 hartree
energy: -1210.107931305162
dipole: 24.45308 -23.63528 0.81780 28.55950 -28.42011 0.13939 -5.15102 3.74644 -1.40458
magnitude: 1.63128 au
magnitude: 4.14639 debye
