program: Orca
programVersion: 5.0.2
elementType: O O O N C C C C C C C C C C C C C C C C C C C C C C C C H H H H H H H H H H H H H H H H H H H H H H H H H
charge: 0
multiplicity: 1
keywords: wb97x-d3
keywords: def2-TZVPP
keywords: def2/J RIJCOSX
keywords: DEFGRID2
keywords: scfconv7
keywords: smallprint printgap noloewdin
keywords: NOSOSCF
formula: C24H25NO3
InChI: InChI=1/C24H25NO3/c1-16(2)13-20-22(24(20,3)4)23(26)28-21(15-25)17-9-8-12-19(14-17)27-18-10-6-5-7-11-18/h5-14,20-22H,1-4H3
53 atoms
O  -0.930413 1.844682 -0.367448
O  1.066716 0.83528 -0.353423
O  -0.96034 -3.772172 0.665393
N  -3.453097 1.746875 -2.502678
C  1.503209 2.650976 2.169437
C  2.207947 3.246793 0.990789
C  0.74228 2.866767 0.871902
C  1.89229 1.259948 2.607361
C  1.087148 3.528859 3.326498
C  2.597172 4.665859 0.913932
C  0.361717 1.73992 0.003788
C  3.682385 5.17014 0.321386
C  4.727976 4.366492 -0.389955
C  3.939628 6.648093 0.326825
C  -1.456628 0.766958 -1.130986
C  -1.91154 -0.360055 -0.235553
C  -2.57397 1.3284 -1.893821
C  -1.222851 -1.562389 -0.241932
C  -2.986194 -0.169007 0.626771
C  -1.627681 -2.586834 0.606546
C  -3.368124 -1.1899 1.477934
C  -2.698028 -2.404654 1.46713
C  -0.6509 -4.435932 -0.48728
C  -1.490659 -4.439573 -1.593946
C  0.52877 -5.166802 -0.495946
C  -1.135002 -5.177708 -2.712716
C  0.86614 -5.906126 -1.618385
C  0.041086 -5.912132 -2.733243
H  2.86723 2.550794 0.48468
H  0.026368 3.680646 0.888637
H  2.255124 0.640085 1.791823
H  2.685174 1.325056 3.354218
H  1.046948 0.745846 3.068218
H  0.706122 4.500402 3.015387
H  0.299778 3.042056 3.903823
H  1.931011 3.703593 3.995749
H  1.91995 5.371348 1.385408
H  4.533756 3.296925 -0.398869
H  4.819479 4.692501 -1.428714
H  5.707179 4.520363 0.069587
H  3.160119 7.200822 0.849511
H  4.893825 6.878976 0.806809
H  4.002183 7.038576 -0.691948
H  -0.714149 0.399919 -1.846155
H  -0.367139 -1.698479 -0.891377
H  -3.525539 0.769621 0.62946
H  -4.204838 -1.048001 2.148318
H  -2.997751 -3.210927 2.123232
H  -2.417398 -3.880561 -1.585986
H  1.169506 -5.15582 0.375662
H  -1.790889 -5.180695 -3.572988
H  1.785826 -6.475895 -1.621313
H  0.310675 -6.486449 -3.608919
totalener: -1210.08397671 hartree
nucrepener: 2432.39919135 hartree
electener: -3642.48316806 hartree
oneelecener: -6475.74763352 hartree
twoeener: 2833.26446547 hartree
kineticenergy: 1204.77562942 hartree
xcener: -118.590899663649 hartree
chargesum: -0.0000000
charge: -0.260191 -0.388465 -0.299761 -0.003673 0.079337 0.037977 -0.090215 -0.253422 -0.254969 -0.184070 0.358532 -0.052459 -0.237144 -0.201269 0.323592 0.004304 -0.260190 -0.109127 -0.173205 0.185623 -0.103659 -0.179118 0.235909 -0.150790 -0.209452 -0.122459 -0.087914 -0.146423 0.091061 0.077143 0.099383 0.088264 0.087433 0.074285 0.091940 0.096069 0.072326 0.084016 0.087110 0.086586 0.076409 0.084242 0.085424 0.116209 0.126305 0.122199 0.130134 0.129864 0.131710 0.125231 0.128261 0.125176 0.125923
qa: -0.2602 -0.3885 -0.2998 -0.0037 0.0793 0.0380 -0.0902 -0.2534 -0.2550 -0.1841 0.3585 -0.0525 -0.2371 -0.2013 0.3236 0.0043 -0.2602 -0.1091 -0.1732 0.1856 -0.1037 -0.1791 0.2359 -0.1508 -0.2095 -0.1225 -0.0879 -0.1464 0.0911 0.0771 0.0994 0.0883 0.0874 0.0743 0.0919 0.0961 0.0723 0.0840 0.0871 0.0866 0.0764 0.0842 0.0854 0.1162 0.1263 0.1222 0.1301 0.1299 0.1317 0.1252 0.1283 0.1252 0.1259
va: 2.1336 2.1163 2.1066 3.1204 3.7470 3.7987 3.8570 3.9126 3.9173 3.9103 4.2249 3.8346 3.9443 3.9339 3.8362 3.6392 4.0258 3.9174 4.0334 3.8887 3.9426 4.0408 3.8121 3.9220 4.0343 3.9591 3.9380 3.9623 1.0295 1.0362 1.0206 1.0010 1.0025 1.0109 1.0041 1.0026 1.0222 1.0162 0.9994 0.9989 1.0124 0.9982 0.9986 1.0216 1.0221 1.0162 0.9996 1.0103 1.0054 1.0141 0.9999 0.9987 1.0004
dispcorr: -0.024370208 hartree
energy: -1210.108346919492
dipole: 26.11587 -25.16911 0.94676 24.18175 -24.25770 -0.07595 12.18861 -11.22565 0.96296
magnitude: 1.35256 au
magnitude: 3.43792 debye
