program: Orca
programVersion: 5.0.2
elementType: O O O N C C C C C C C C C C C C C C C C C C C C C C C C H H H H H H H H H H H H H H H H H H H H H H H H H
charge: 0
multiplicity: 1
keywords: wb97x-d3
keywords: def2-TZVPP
keywords: def2/J RIJCOSX
keywords: DEFGRID2
keywords: scfconv7
keywords: smallprint printgap noloewdin
keywords: NOSOSCF
formula: C24H25NO3
InChI: InChI=1/C24H25NO3/c1-16(2)13-20-22(24(20,3)4)23(26)28-21(15-25)17-9-8-12-19(14-17)27-18-10-6-5-7-11-18/h5-14,20-22H,1-4H3
53 atoms
O  -1.185926 1.76696 0.164859
O  -1.469287 2.21441 -2.005337
O  -1.399396 -3.365715 0.167734
N  -3.184254 1.646682 2.7853
C  1.424449 3.362028 -0.117942
C  1.684557 1.886003 -0.068525
C  0.702786 2.435229 -1.082114
C  0.700605 4.017294 1.034364
C  2.466528 4.263974 -0.737009
C  2.949693 1.280666 -0.537911
C  -0.743698 2.14207 -1.053642
C  3.811389 0.598196 0.218966
C  3.630789 0.35292 1.685824
C  5.049424 -0.004655 -0.3731
C  -2.552405 1.403903 0.260392
C  -2.795903 -0.008095 -0.217618
C  -2.894171 1.540516 1.679065
C  -1.950285 -1.024067 0.206592
C  -3.861778 -0.282279 -1.059422
C  -2.171629 -2.320855 -0.233409
C  -4.088813 -1.587305 -1.470043
C  -3.244255 -2.607281 -1.068486
C  -0.044843 -3.22921 0.272436
C  0.57724 -3.917948 1.304149
C  0.704366 -2.491293 -0.636287
C  1.958009 -3.87968 1.416073
C  2.083842 -2.453248 -0.505649
C  2.717061 -3.147348 0.515187
H  1.221754 1.382017 0.772333
H  1.056659 2.494773 -2.105779
H  1.432032 4.402898 1.746595
H  0.103026 4.864121 0.691417
H  0.045746 3.340968 1.577115
H  2.01734 5.205637 -1.056218
H  3.246229 4.494574 -0.009311
H  2.952497 3.81915 -1.604304
H  3.183397 1.400526 -1.592099
H  4.54262 0.605848 2.231359
H  2.819212 0.9285 2.12495
H  3.430834 -0.704576 1.876936
H  5.949055 0.40156 0.095584
H  5.077417 -1.085243 -0.206901
H  5.122186 0.170458 -1.445968
H  -3.180858 2.097333 -0.308063
H  -1.124711 -0.809876 0.874371
H  -4.506844 0.516731 -1.400656
H  -4.919209 -1.809289 -2.126376
H  -3.406727 -3.625623 -1.395712
H  -0.022084 -4.485352 2.00384
H  0.223112 -1.956949 -1.445185
H  2.440865 -4.423666 2.217108
H  2.664219 -1.875437 -1.212088
H  3.795133 -3.123435 0.603864
totalener: -1210.08014234 hartree
nucrepener: 2593.38686697 hartree
electener: -3803.46700931 hartree
oneelecener: -6797.39895080 hartree
twoeener: 2993.93194148 hartree
kineticenergy: 1204.77516275 hartree
xcener: -118.592696795141 hartree
chargesum: 0.0000000
charge: -0.277267 -0.343395 -0.297791 0.001429 0.133759 0.059395 -0.131748 -0.271275 -0.239929 -0.240484 0.328449 -0.046205 -0.236497 -0.216536 0.286143 0.072747 -0.265641 -0.176114 -0.151632 0.205438 -0.087282 -0.200399 0.264584 -0.225876 -0.178960 -0.065126 -0.063112 -0.222397 0.088692 0.077854 0.085959 0.094318 0.096173 0.095333 0.091371 0.073345 0.082001 0.089989 0.084717 0.093075 0.097129 0.077796 0.085644 0.123431 0.134073 0.108577 0.127901 0.129463 0.126292 0.131576 0.126734 0.127497 0.136779
qa: -0.2773 -0.3434 -0.2978 0.0014 0.1338 0.0594 -0.1317 -0.2713 -0.2399 -0.2405 0.3284 -0.0462 -0.2365 -0.2165 0.2861 0.0727 -0.2656 -0.1761 -0.1516 0.2054 -0.0873 -0.2004 0.2646 -0.2259 -0.1790 -0.0651 -0.0631 -0.2224 0.0887 0.0779 0.0860 0.0943 0.0962 0.0953 0.0914 0.0733 0.0820 0.0900 0.0847 0.0931 0.0971 0.0778 0.0856 0.1234 0.1341 0.1086 0.1279 0.1295 0.1263 0.1316 0.1267 0.1275 0.1368
va: 2.0902 2.1678 2.1162 3.1169 3.7083 3.7048 3.9317 3.9275 3.9222 3.8615 4.2468 3.7799 3.9335 3.9256 3.8817 3.6277 4.0160 3.9556 4.0328 3.8748 3.9488 4.0453 3.7855 4.0634 3.9606 3.9344 3.8691 3.9448 1.0214 1.0363 1.0034 1.0019 1.0104 1.0039 1.0052 1.0099 1.0184 1.0017 1.0109 1.0048 1.0025 0.9979 1.0096 1.0206 1.0136 1.0129 0.9998 1.0108 1.0141 1.0062 0.9985 0.9981 0.9945
dispcorr: -0.029943612 hartree
energy: -1210.110085951945
dipole: 32.07428 -30.81786 1.25642 11.41585 -11.57635 -0.16051 0.44434 -1.10676 -0.66242
magnitude: 1.42939 au
magnitude: 3.63322 debye
