program: Orca
programVersion: 5.0.2
elementType: O O O N C C C C C C C C C C C C C C C C C C C C C C C C H H H H H H H H H H H H H H H H H H H H H H H H H
charge: 0
multiplicity: 1
keywords: wb97x-d3
keywords: def2-TZVPP
keywords: def2/J RIJCOSX
keywords: DEFGRID2
keywords: scfconv7
keywords: smallprint printgap noloewdin
keywords: NOSOSCF
formula: C24H25NO3
InChI: InChI=1/C24H25NO3/c1-16(2)13-20-22(24(20,3)4)23(26)28-21(15-25)17-9-8-12-19(14-17)27-18-10-6-5-7-11-18/h5-14,20-22H,1-4H3
53 atoms
O  -1.255048 1.85268 0.585169
O  -1.564959 2.980041 -1.318854
O  -0.774441 -3.167087 -0.58097
N  -3.34514 0.675576 2.868987
C  1.546842 3.094594 0.686422
C  1.594928 1.735107 0.074348
C  0.639603 2.774414 -0.488091
C  1.000057 3.26275 2.083917
C  2.65564 4.072118 0.368831
C  2.744979 1.264508 -0.739974
C  -0.821046 2.580848 -0.466209
C  2.657145 0.598047 -1.893288
C  1.357255 0.245723 -2.553834
C  3.885531 0.164154 -2.634966
C  -2.553482 1.288316 0.456658
C  -2.489769 0.069287 -0.432406
C  -2.981328 0.94786 1.8144
C  -1.684485 -0.996062 -0.041798
C  -3.149048 0.049545 -1.648901
C  -1.5369 -2.086145 -0.884949
C  -3.008655 -1.057822 -2.47635
C  -2.204329 -2.118815 -2.107082
C  0.136748 -3.071918 0.439928
C  -0.082622 -3.798019 1.598271
C  1.270888 -2.284697 0.297262
C  0.851667 -3.740419 2.622895
C  2.1925 -2.22805 1.330393
C  1.986756 -2.95475 2.494925
H  1.114211 0.961477 0.669026
H  0.945361 3.229227 -1.423197
H  0.517402 4.234667 2.200086
H  0.282167 2.496042 2.361723
H  1.820609 3.217384 2.802139
H  3.49359 3.939494 1.05607
H  3.037389 3.955248 -0.645263
H  2.302026 5.098847 0.47443
H  3.734065 1.470967 -0.339573
H  0.491284 0.370807 -1.907435
H  1.197933 0.860296 -3.44372
H  1.364731 -0.791568 -2.89704
H  4.800974 0.479927 -2.136266
H  3.91695 -0.922852 -2.741463
H  3.89504 0.575124 -3.647469
H  -3.261211 2.017572 0.051161
H  -1.181358 -0.970412 0.917135
H  -3.751626 0.892623 -1.958651
H  -3.519479 -1.084812 -3.429353
H  -2.084345 -2.977073 -2.754979
H  -0.974574 -4.403261 1.692121
H  1.433943 -1.717554 -0.609967
H  0.684026 -4.308211 3.528303
H  3.073871 -1.610499 1.217813
H  2.708975 -2.909338 3.298779
totalener: -1210.07854218 hartree
nucrepener: 2649.11473709 hartree
electener: -3859.19327927 hartree
oneelecener: -6908.95395215 hartree
twoeener: 3049.76067287 hartree
kineticenergy: 1204.77347867 hartree
xcener: -118.591228422929 hartree
chargesum: -0.0000000
charge: -0.274048 -0.346467 -0.296017 0.000725 0.134494 0.015322 -0.095255 -0.254142 -0.276845 -0.284101 0.297269 -0.007484 -0.214527 -0.214538 0.322377 0.016247 -0.278956 -0.211608 -0.130675 0.232540 -0.073645 -0.211295 0.174906 -0.125746 -0.130732 -0.131766 -0.177978 -0.092231 0.089970 0.093466 0.093100 0.097058 0.082934 0.090520 0.087681 0.096077 0.097951 0.054618 0.113887 0.095963 0.080135 0.087918 0.090661 0.120925 0.127742 0.114604 0.127413 0.127025 0.127417 0.149635 0.128130 0.131662 0.127684
qa: -0.2740 -0.3465 -0.2960 0.0007 0.1345 0.0153 -0.0953 -0.2541 -0.2768 -0.2841 0.2973 -0.0075 -0.2145 -0.2145 0.3224 0.0162 -0.2790 -0.2116 -0.1307 0.2325 -0.0736 -0.2113 0.1749 -0.1257 -0.1307 -0.1318 -0.1780 -0.0922 0.0900 0.0935 0.0931 0.0971 0.0829 0.0905 0.0877 0.0961 0.0980 0.0546 0.1139 0.0960 0.0801 0.0879 0.0907 0.1209 0.1277 0.1146 0.1274 0.1270 0.1274 0.1496 0.1281 0.1317 0.1277
va: 2.0945 2.1574 2.1233 3.1171 3.7607 3.7555 3.8246 3.9060 3.9211 3.8409 4.2456 3.7318 3.9382 3.9433 3.8684 3.6602 4.0291 3.9210 3.9988 3.8381 3.9467 4.0321 3.8771 3.9832 3.9053 3.9614 3.9874 3.9246 1.0198 1.0231 1.0023 1.0132 1.0031 1.0018 1.0041 1.0055 1.0122 1.0164 1.0033 0.9965 1.0096 0.9985 0.9988 1.0194 1.0210 1.0174 0.9986 1.0130 1.0104 0.9736 0.9997 1.0035 0.9995
dispcorr: -0.032277056 hartree
energy: -1210.110819237341
dipole: 26.23599 -24.85127 1.38472 10.00601 -10.15628 -0.15027 -6.33191 5.55600 -0.77592
magnitude: 1.59439 au
magnitude: 4.05262 debye
