program: Orca
programVersion: 5.0.2
elementType: O O O N C C C C C C C C C C C C C C C C C C C C C C C C H H H H H H H H H H H H H H H H H H H H H H H H H
charge: 0
multiplicity: 1
keywords: wb97x-d3
keywords: def2-TZVPP
keywords: def2/J RIJCOSX
keywords: DEFGRID2
keywords: scfconv7
keywords: smallprint printgap noloewdin
keywords: NOSOSCF
formula: C24H25NO3
InChI: InChI=1/C24H25NO3/c1-16(2)13-20-22(24(20,3)4)23(26)28-21(15-25)17-9-8-12-19(14-17)27-18-10-6-5-7-11-18/h5-14,20-22H,1-4H3
53 atoms
O  -0.914001 1.680947 -0.150512
O  0.987697 0.544324 -0.460598
O  -1.572675 -4.086588 0.50341
N  -3.741142 1.7918 -1.85446
C  2.014899 2.353347 1.885733
C  2.457381 2.953796 0.594351
C  0.99733 2.596591 0.780319
C  2.454711 0.952725 2.234436
C  1.86745 3.248408 3.093162
C  2.875609 4.376662 0.504506
C  0.412323 1.490947 0.003748
C  2.461829 5.269956 -0.395501
C  1.487282 4.965775 -1.492055
C  2.960846 6.683317 -0.369613
C  -1.626168 0.653889 -0.824795
C  -2.000913 -0.464876 0.117197
C  -2.81242 1.301075 -1.389722
C  -1.585286 -1.757548 -0.1660
C  -2.737578 -0.189363 1.260765
C  -1.909996 -2.788366 0.70837
C  -3.057694 -1.225981 2.122183
C  -2.645644 -2.520465 1.856406
C  -0.625064 -4.427288 -0.42336
C  -0.991203 -5.312343 -1.424742
C  0.677286 -3.95343 -0.335105
C  -0.042022 -5.731402 -2.345135
C  1.613061 -4.370088 -1.268651
C  1.259259 -5.258543 -2.274389
H  2.996489 2.266766 -0.054658
H  0.32173 3.42545 0.956402
H  2.616364 0.329108 1.359153
H  3.393182 0.995884 2.790174
H  1.718391 0.45722 2.869796
H  2.817817 3.336411 3.623469
H  1.541829 4.254414 2.829291
H  1.138783 2.832841 3.790739
H  3.604437 4.697859 1.243844
H  1.902948 5.255077 -2.459941
H  1.219666 3.914262 -1.55126
H  0.566831 5.542097 -1.367499
H  3.468888 6.937234 -1.302932
H  2.131693 7.387714 -0.266372
H  3.655493 6.860238 0.450409
H  -1.035816 0.255498 -1.656075
H  -1.006222 -1.950037 -1.059727
H  -3.063219 0.819899 1.476668
H  -3.634056 -1.025763 3.015397
H  -2.893264 -3.330671 2.529398
H  -2.010402 -5.672391 -1.473312
H  0.957206 -3.263374 0.45069
H  -0.326397 -6.425684 -3.124555
H  2.626845 -3.997999 -1.205141
H  1.995963 -5.582639 -2.996822
totalener: -1210.08255242 hartree
nucrepener: 2473.65405715 hartree
electener: -3683.73660957 hartree
oneelecener: -6558.29766452 hartree
twoeener: 2874.56105495 hartree
kineticenergy: 1204.77406105 hartree
xcener: -118.590054622450 hartree
chargesum: -0.0000000
charge: -0.262886 -0.383351 -0.292950 -0.003263 0.115515 0.001859 -0.149562 -0.260078 -0.264183 -0.244168 0.350074 -0.011308 -0.220829 -0.209507 0.309653 -0.003911 -0.253213 -0.132787 -0.199096 0.253875 -0.086994 -0.202582 0.246521 -0.194120 -0.182180 -0.098048 -0.105088 -0.137334 0.104919 0.098296 0.097961 0.085658 0.089391 0.089654 0.087380 0.093679 0.094229 0.092797 0.085092 0.093222 0.088622 0.085880 0.078767 0.115181 0.117050 0.122765 0.127478 0.127401 0.126442 0.135045 0.127085 0.129028 0.126922
qa: -0.2629 -0.3834 -0.2930 -0.0033 0.1155 0.0019 -0.1496 -0.2601 -0.2642 -0.2442 0.3501 -0.0113 -0.2208 -0.2095 0.3097 -0.0039 -0.2532 -0.1328 -0.1991 0.2539 -0.0870 -0.2026 0.2465 -0.1941 -0.1822 -0.0980 -0.1051 -0.1373 0.1049 0.0983 0.0980 0.0857 0.0894 0.0897 0.0874 0.0937 0.0942 0.0928 0.0851 0.0932 0.0886 0.0859 0.0788 0.1152 0.1171 0.1228 0.1275 0.1274 0.1264 0.1350 0.1271 0.1290 0.1269
va: 2.1168 2.1203 2.1220 3.1223 3.7456 3.7997 3.8712 3.9083 3.9070 3.8903 4.1694 3.7557 3.9341 3.9405 3.8525 3.7094 4.0206 3.9207 4.0401 3.8608 3.9436 4.0297 3.7934 4.0487 3.9808 3.9314 3.9375 3.9547 1.0229 1.0271 1.0202 1.0027 1.0016 1.0027 1.0060 1.0059 1.0111 1.0024 1.0135 1.0014 0.9993 0.9995 1.0098 1.0261 1.0181 1.0173 0.9993 1.0131 1.0125 1.0035 0.9991 0.9993 1.0003
dispcorr: -0.025717605 hartree
energy: -1210.108270021447
dipole: 23.72221 -22.42590 1.29631 25.92411 -25.95485 -0.03074 7.63783 -6.90386 0.73396
magnitude: 1.48999 au
magnitude: 3.78725 debye
