program: Orca
programVersion: 5.0.2
elementType: O O O N C C C C C C C C C C C C C C C C C C C C C C C C H H H H H H H H H H H H H H H H H H H H H H H H H
charge: 0
multiplicity: 1
keywords: wb97x-d3
keywords: def2-TZVPP
keywords: def2/J RIJCOSX
keywords: DEFGRID2
keywords: scfconv7
keywords: smallprint printgap noloewdin
keywords: NOSOSCF
formula: C24H25NO3
InChI: InChI=1/C24H25NO3/c1-16(2)13-20-22(24(20,3)4)23(26)28-21(15-25)17-9-8-12-19(14-17)27-18-10-6-5-7-11-18/h5-14,20-22H,1-4H3
53 atoms
O  -1.158841 1.811962 0.163966
O  -1.383229 2.078057 -2.042273
O  -1.391171 -3.314687 0.242126
N  -3.193868 1.760956 2.756354
C  1.441966 3.422878 -0.207661
C  1.708831 1.966491 0.030092
C  0.763484 2.381354 -1.081122
C  0.664473 4.199169 0.828197
C  2.491869 4.267412 -0.891069
C  2.993212 1.324349 -0.310401
C  -0.682639 2.08614 -1.069391
C  3.716055 0.526456 0.47952
C  3.337767 0.127834 1.872669
C  5.01302 -0.053334 -0.000055
C  -2.528372 1.458668 0.246503
C  -2.77817 0.037515 -0.201314
C  -2.889199 1.630318 1.656651
C  -1.935599 -0.973585 0.238802
C  -3.848275 -0.248801 -1.034155
C  -2.163067 -2.276748 -0.178961
C  -4.082081 -1.559301 -1.420875
C  -3.238413 -2.574892 -1.005159
C  -0.030226 -3.216796 0.249629
C  0.680216 -2.460732 -0.675341
C  0.638619 -3.970196 1.205157
C  2.066514 -2.471963 -0.638728
C  2.023592 -3.98107 1.221335
C  2.744471 -3.233994 0.300864
H  1.213713 1.567967 0.907364
H  1.155031 2.322545 -2.090822
H  1.36012 4.674725 1.521617
H  0.076077 4.991862 0.361842
H  -0.007834 3.582174 1.418365
H  3.242345 4.594791 -0.16968
H  3.013321 3.740445 -1.688573
H  2.038871 5.157904 -1.329458
H  3.381738 1.530951 -1.303476
H  2.444151 0.623361 2.244406
H  3.165049 -0.949888 1.926024
H  4.149176 0.352589 2.568833
H  5.845203 0.276616 0.626787
H  4.999752 -1.144786 0.057041
H  5.237271 0.226705 -1.028673
H  -3.144102 2.142669 -0.347112
H  -1.105795 -0.75243 0.899259
H  -4.491298 0.546413 -1.387992
H  -4.915573 -1.7895 -2.070383
H  -3.404489 -3.598193 -1.314547
H  0.165959 -1.87439 -1.425607
H  0.069645 -4.550477 1.9195
H  2.616949 -1.87862 -1.356364
H  2.540835 -4.576786 1.961888
H  3.82607 -3.249757 0.313477
totalener: -1210.08011773 hartree
nucrepener: 2596.05215403 hartree
electener: -3806.13227176 hartree
oneelecener: -6802.73103370 hartree
twoeener: 2996.59876194 hartree
kineticenergy: 1204.77584661 hartree
xcener: -118.593704853484 hartree
chargesum: -0.0000000
charge: -0.277827 -0.341066 -0.297254 0.001683 0.093184 0.092635 -0.101065 -0.259880 -0.248856 -0.225907 0.321251 -0.065229 -0.232870 -0.210150 0.284208 0.081185 -0.263677 -0.190281 -0.149883 0.209831 -0.088758 -0.196714 0.272518 -0.177006 -0.230755 -0.070829 -0.063650 -0.226219 0.082982 0.076944 0.087470 0.092880 0.094231 0.093512 0.072344 0.094168 0.074936 0.082927 0.093509 0.090901 0.096445 0.075789 0.082034 0.123277 0.133651 0.106992 0.128016 0.129294 0.132818 0.126214 0.124011 0.126870 0.139167
qa: -0.2778 -0.3411 -0.2973 0.0017 0.0932 0.0926 -0.1011 -0.2599 -0.2489 -0.2259 0.3213 -0.0652 -0.2329 -0.2101 0.2842 0.0812 -0.2637 -0.1903 -0.1499 0.2098 -0.0888 -0.1967 0.2725 -0.1770 -0.2308 -0.0708 -0.0637 -0.2262 0.0830 0.0769 0.0875 0.0929 0.0942 0.0935 0.0723 0.0942 0.0749 0.0829 0.0935 0.0909 0.0964 0.0758 0.0820 0.1233 0.1337 0.1070 0.1280 0.1293 0.1328 0.1262 0.1240 0.1269 0.1392
va: 2.0889 2.1689 2.1175 3.1169 3.7335 3.7009 3.8796 3.9239 3.9283 3.8669 4.2498 3.8273 3.9297 3.9234 3.8796 3.6118 4.0144 3.9718 4.0353 3.8655 3.9488 4.0485 3.7865 3.9409 4.0582 3.8745 3.9124 3.9424 1.0287 1.0344 1.0032 1.0014 1.0113 1.0037 1.0111 1.0038 1.0211 1.0142 1.0024 1.0020 1.0018 1.0014 1.0110 1.0191 1.0140 1.0133 0.9999 1.0106 1.0063 1.0145 1.0022 0.9984 0.9936
dispcorr: -0.029933541 hartree
energy: -1210.110051270914
dipole: 31.36216 -30.18166 1.18050 11.07126 -11.20571 -0.13445 0.56423 -1.25736 -0.69313
magnitude: 1.37553 au
magnitude: 3.49633 debye
