program: Orca
programVersion: 5.0.2
elementType: O O O N C C C C C C C C C C C C C C C C C C C C C C C C H H H H H H H H H H H H H H H H H H H H H H H H H
charge: 0
multiplicity: 1
keywords: wb97x-d3
keywords: def2-TZVPP
keywords: def2/J RIJCOSX
keywords: DEFGRID2
keywords: scfconv7
keywords: smallprint printgap noloewdin
keywords: NOSOSCF
formula: C24H25NO3
InChI: InChI=1/C24H25NO3/c1-16(2)13-20-22(24(20,3)4)23(26)28-21(15-25)17-9-8-12-19(14-17)27-18-10-6-5-7-11-18/h5-14,20-22H,1-4H3
53 atoms
O  -0.996156 1.812492 0.983834
O  0.434214 1.714297 -0.73361
O  -0.537313 -3.233686 -1.63983
N  -4.293528 1.577124 1.156783
C  2.519304 2.556488 1.453798
C  2.114815 3.761944 0.664206
C  1.044378 2.873406 1.271844
C  3.152747 1.398287 0.721953
C  3.060799 2.725729 2.854091
C  2.271266 5.141035 1.162264
C  0.178842 2.082385 0.380768
C  2.71927 6.194936 0.475783
C  3.161824 6.160078 -0.955389
C  2.811194 7.545896 1.120945
C  -1.909085 1.005379 0.252905
C  -1.606222 -0.463567 0.421642
C  -3.238424 1.335268 0.772765
C  -1.223573 -1.213982 -0.677829
C  -1.697596 -1.052714 1.67758
C  -0.937584 -2.564928 -0.526188
C  -1.398783 -2.39625 1.81884
C  -1.016602 -3.160483 0.726018
C  -0.827553 -4.562356 -1.776746
C  -2.109046 -5.054827 -1.562017
C  0.1909 -5.404738 -2.194139
C  -2.359673 -6.403038 -1.760142
C  -0.076965 -6.749984 -2.400496
C  -1.348512 -7.256263 -2.178863
H  2.216152 3.63402 -0.407685
H  0.544496 3.255508 2.154862
H  4.236573 1.527834 0.711198
H  2.938667 0.454392 1.226815
H  2.819293 1.308407 -0.308445
H  2.554742 3.507244 3.418908
H  2.95577 1.796211 3.41557
H  4.121844 2.978533 2.822355
H  1.980496 5.308419 2.195111
H  2.559552 6.842046 -1.56048
H  4.196682 6.499157 -1.044506
H  3.101614 5.174876 -1.411435
H  3.837229 7.921718 1.10371
H  2.202694 8.278375 0.584669
H  2.477481 7.530587 2.157756
H  -1.891529 1.268165 -0.809464
H  -1.134138 -0.757951 -1.655602
H  -2.005981 -0.471138 2.536938
H  -1.463253 -2.862297 2.792864
H  -0.783757 -4.209484 0.853578
H  -2.905073 -4.39236 -1.246994
H  1.181459 -5.002822 -2.361268
H  -3.357562 -6.786058 -1.592336
H  0.718182 -7.405395 -2.72998
H  -1.552287 -8.306762 -2.335013
totalener: -1210.08401887 hartree
nucrepener: 2393.31204975 hartree
electener: -3603.39606862 hartree
oneelecener: -6397.60865615 hartree
twoeener: 2794.21258752 hartree
kineticenergy: 1204.77133926 hartree
xcener: -118.590054040731 hartree
chargesum: -0.0000000
charge: -0.263074 -0.386355 -0.295574 -0.004418 0.079354 0.046382 -0.103295 -0.253903 -0.245837 -0.185954 0.357492 -0.052715 -0.236146 -0.201149 0.318935 0.010339 -0.257381 -0.145920 -0.174076 0.193538 -0.116453 -0.143741 0.227191 -0.157712 -0.199314 -0.117598 -0.096546 -0.138458 0.090451 0.076378 0.086902 0.087443 0.100512 0.072807 0.091915 0.094526 0.072610 0.088073 0.085925 0.082442 0.083861 0.085977 0.076986 0.116458 0.114849 0.123162 0.129885 0.134647 0.136405 0.127493 0.129308 0.126618 0.126751
qa: -0.2631 -0.3864 -0.2956 -0.0044 0.0794 0.0464 -0.1033 -0.2539 -0.2458 -0.1860 0.3575 -0.0527 -0.2361 -0.2011 0.3189 0.0103 -0.2574 -0.1459 -0.1741 0.1935 -0.1165 -0.1437 0.2272 -0.1577 -0.1993 -0.1176 -0.0965 -0.1385 0.0905 0.0764 0.0869 0.0874 0.1005 0.0728 0.0919 0.0945 0.0726 0.0881 0.0859 0.0824 0.0839 0.0860 0.0770 0.1165 0.1148 0.1232 0.1299 0.1346 0.1364 0.1275 0.1293 0.1266 0.1268
va: 2.1328 2.1199 2.1098 3.1213 3.7415 3.7896 3.8864 3.9134 3.9163 3.9036 4.2197 3.8318 3.9453 3.9339 3.8367 3.6629 4.0234 4.0397 4.0331 3.9150 3.9593 3.9353 3.8167 3.9468 4.0354 3.9456 3.9356 3.9570 1.0329 1.0378 1.0007 1.0026 1.0208 1.0110 1.0044 1.0035 1.0219 0.9990 0.9993 1.0158 0.9985 0.9983 1.0123 1.0213 1.0306 1.0166 1.0011 1.0030 1.0021 1.0128 0.9996 0.9989 1.0001
dispcorr: -0.024010940 hartree
energy: -1210.108029812921
dipole: 28.07033 -26.60557 1.46476 24.67679 -25.23650 -0.55971 6.50014 -6.26686 0.23329
magnitude: 1.58531 au
magnitude: 4.02954 debye
