program: Orca
programVersion: 5.0.2
elementType: O O O N C C C C C C C C C C C C C C C C C C C C C C C C H H H H H H H H H H H H H H H H H H H H H H H H H
charge: 0
multiplicity: 1
keywords: wb97x-d3
keywords: def2-TZVPP
keywords: def2/J RIJCOSX
keywords: DEFGRID2
keywords: scfconv7
keywords: smallprint printgap noloewdin
keywords: NOSOSCF
formula: C24H25NO3
InChI: InChI=1/C24H25NO3/c1-16(2)13-20-22(24(20,3)4)23(26)28-21(15-25)17-9-8-12-19(14-17)27-18-10-6-5-7-11-18/h5-14,20-22H,1-4H3
53 atoms
O  -0.698396 1.611482 1.161768
O  0.362406 1.978989 -0.774401
O  -1.057215 -3.410782 -1.960065
N  -3.807727 0.71005 1.878914
C  2.694066 2.860977 1.135947
C  1.991743 4.079491 0.622415
C  1.181989 2.962686 1.252615
C  3.325399 1.92233 0.136484
C  3.460434 2.93611 2.435315
C  2.063263 5.38722 1.301391
C  0.2831 2.156215 0.40923
C  2.296191 6.572377 0.733109
C  2.534119 6.788213 -0.73033
C  2.336014 7.822235 1.561201
C  -1.586382 0.729798 0.50083
C  -1.033362 -0.67485 0.409011
C  -2.822222 0.73338 1.289445
C  -1.273292 -1.424611 -0.73092
C  -0.342746 -1.228232 1.479457
C  -0.823554 -2.735486 -0.802835
C  0.115171 -2.532566 1.389649
C  -0.120656 -3.294799 0.256613
C  -1.413264 -4.729482 -1.912999
C  -2.336888 -5.209886 -0.992668
C  -0.858874 -5.574285 -2.862735
C  -2.697004 -6.547717 -1.029182
C  -1.235932 -6.9082 -2.893219
C  -2.151157 -7.402333 -1.975898
H  1.906851 4.111654 -0.458083
H  0.809192 3.14272 2.254784
H  3.322037 0.89537 0.506973
H  2.827804 1.929362 -0.82971
H  4.365769 2.211426 -0.022877
H  2.966413 3.546297 3.189797
H  3.59351 1.938488 2.856759
H  4.450909 3.361928 2.266619
H  1.905561 5.374101 2.375742
H  3.495846 7.280478 -0.893065
H  2.533595 5.871437 -1.315183
H  1.77227 7.450105 -1.149903
H  1.581031 8.538731 1.227389
H  2.161229 7.621681 2.617637
H  3.302662 8.323922 1.470071
H  -1.825262 1.097338 -0.502735
H  -1.806465 -1.000991 -1.573202
H  -0.162557 -0.651264 2.376528
H  0.663001 -2.967029 2.215129
H  0.242151 -4.312737 0.198077
H  -2.777556 -4.547809 -0.258288
H  -0.14401 -5.181681 -3.573833
H  -3.418135 -6.920645 -0.313973
H  -0.804729 -7.564739 -3.637333
H  -2.440396 -8.444093 -2.000223
totalener: -1210.08318182 hartree
nucrepener: 2382.09318335 hartree
electener: -3592.17636517 hartree
oneelecener: -6375.07492154 hartree
twoeener: 2782.89855637 hartree
kineticenergy: 1204.76714817 hartree
xcener: -118.589105378704 hartree
chargesum: -0.0000000
charge: -0.274692 -0.372774 -0.298034 -0.002638 0.089092 0.040737 -0.102104 -0.251248 -0.245812 -0.186479 0.329163 -0.050318 -0.236091 -0.201604 0.308397 0.070847 -0.250582 -0.179642 -0.184361 0.181373 -0.112045 -0.133881 0.222452 -0.146166 -0.202896 -0.122181 -0.095908 -0.139674 0.090665 0.077472 0.085811 0.100454 0.087143 0.073156 0.091243 0.094836 0.073311 0.085003 0.082986 0.089437 0.085947 0.076781 0.083849 0.122248 0.110005 0.125682 0.129334 0.136058 0.137113 0.127112 0.128701 0.126341 0.126380
qa: -0.2747 -0.3728 -0.2980 -0.0026 0.0891 0.0407 -0.1021 -0.2512 -0.2458 -0.1865 0.3292 -0.0503 -0.2361 -0.2016 0.3084 0.0708 -0.2506 -0.1796 -0.1844 0.1814 -0.1120 -0.1339 0.2225 -0.1462 -0.2029 -0.1222 -0.0959 -0.1397 0.0907 0.0775 0.0858 0.1005 0.0871 0.0732 0.0912 0.0948 0.0733 0.0850 0.0830 0.0894 0.0859 0.0768 0.0838 0.1222 0.1100 0.1257 0.1293 0.1361 0.1371 0.1271 0.1287 0.1263 0.1264
va: 2.1100 2.1323 2.1035 3.1235 3.7323 3.8041 3.8757 3.9124 3.9162 3.9039 4.2409 3.8266 3.9455 3.9348 3.8251 3.6731 4.0207 4.0954 4.0121 3.9215 3.9530 3.9413 3.8180 3.9293 4.0307 3.9539 3.9392 3.9563 1.0335 1.0382 1.0034 1.0207 1.0012 1.0106 1.0044 1.0039 1.0215 0.9999 1.0151 0.9987 0.9984 1.0122 0.9986 1.0258 1.0243 1.0201 1.0008 1.0020 1.0028 1.0130 0.9999 0.9987 1.0001
dispcorr: -0.024065198 hartree
energy: -1210.107247019114
dipole: 26.95393 -25.37070 1.58323 28.91221 -29.10837 -0.19615 5.32564 -5.29688 0.02876
magnitude: 1.59560 au
magnitude: 4.05568 debye
