program: Orca
programVersion: 5.0.2
elementType: O O O N C C C C C C C C C C C C C C C C C C C C C C C C H H H H H H H H H H H H H H H H H H H H H H H H H
charge: 0
multiplicity: 1
keywords: wb97x-d3
keywords: def2-TZVPP
keywords: def2/J RIJCOSX
keywords: DEFGRID2
keywords: scfconv7
keywords: smallprint printgap noloewdin
keywords: NOSOSCF
formula: C24H25NO3
InChI: InChI=1/C24H25NO3/c1-16(2)13-20-22(24(20,3)4)23(26)28-21(15-25)17-9-8-12-19(14-17)27-18-10-6-5-7-11-18/h5-14,20-22H,1-4H3
53 atoms
O  -1.058983 1.817573 0.569571
O  -1.684791 3.014545 -1.213315
O  -0.618469 -3.260163 -0.736746
N  -2.763476 0.455682 3.051233
C  1.533315 3.449438 0.553088
C  1.723118 2.142165 -0.135664
C  0.589938 3.061071 -0.572199
C  1.077165 3.471435 1.992641
C  2.464376 4.592262 0.219724
C  2.846589 1.862129 -1.064652
C  -0.822857 2.664284 -0.454852
C  2.792255 0.995409 -2.077787
C  1.562447 0.21441 -2.430922
C  3.98063 0.749085 -2.957171
C  -2.322833 1.166423 0.575755
C  -2.296645 -0.020296 -0.35673
C  -2.559218 0.769971 1.965513
C  -1.483162 -1.10778 -0.048374
C  -3.007197 0.018998 -1.544036
C  -1.390939 -2.163999 -0.941626
C  -2.907373 -1.047458 -2.428732
C  -2.106091 -2.13359 -2.137157
C  0.030458 -3.411137 0.462244
C  -0.65315 -3.913368 1.559094
C  1.375831 -3.0915 0.546055
C  0.026792 -4.10411 2.751748
C  2.047558 -3.291366 1.743405
C  1.376282 -3.795524 2.847176
H  1.389729 1.284921 0.442819
H  0.755459 3.597437 -1.499177
H  0.459898 4.348842 2.193675
H  0.511157 2.589856 2.280697
H  1.94826 3.527892 2.647698
H  1.990789 5.548375 0.44734
H  3.379344 4.527716 0.811882
H  2.749871 4.608579 -0.831837
H  3.779868 2.386949 -0.882896
H  1.78364 -0.854212 -2.492288
H  0.746797 0.340737 -1.722117
H  1.190717 0.506736 -3.41624
H  4.285843 -0.29952 -2.920839
H  3.747243 0.967744 -4.002023
H  4.837087 1.357576 -2.669818
H  -3.119004 1.856953 0.281976
H  -0.932698 -1.125149 0.884488
H  -3.617529 0.877688 -1.787874
H  -3.457055 -1.026629 -3.360042
H  -2.02442 -2.964791 -2.825134
H  -1.704793 -4.155301 1.475949
H  1.890823 -2.698308 -0.320989
H  -0.502181 -4.496364 3.609914
H  3.099448 -3.048295 1.81248
H  1.902423 -3.948501 3.779638
totalener: -1210.07939449 hartree
nucrepener: 2594.15645854 hartree
electener: -3804.23585304 hartree
oneelecener: -6799.24319256 hartree
twoeener: 2995.00733952 hartree
kineticenergy: 1204.77214487 hartree
xcener: -118.589185308606 hartree
chargesum: -0.0000000
charge: -0.268915 -0.354971 -0.292847 -0.002468 0.141228 -0.011529 -0.097324 -0.249151 -0.284666 -0.241629 0.325186 -0.009336 -0.185675 -0.211994 0.314966 0.003295 -0.278802 -0.203806 -0.129139 0.231909 -0.078132 -0.207689 0.199649 -0.131889 -0.155338 -0.123550 -0.133975 -0.107557 0.096790 0.087104 0.093055 0.094447 0.083567 0.095088 0.092564 0.084870 0.095947 0.079752 0.036674 0.099006 0.086055 0.086989 0.079416 0.121287 0.120477 0.116505 0.127295 0.125783 0.129064 0.126989 0.129391 0.127942 0.128092
qa: -0.2689 -0.3550 -0.2928 -0.0025 0.1412 -0.0115 -0.0973 -0.2492 -0.2847 -0.2416 0.3252 -0.0093 -0.1857 -0.2120 0.3150 0.0033 -0.2788 -0.2038 -0.1291 0.2319 -0.0781 -0.2077 0.1996 -0.1319 -0.1553 -0.1236 -0.1340 -0.1076 0.0968 0.0871 0.0931 0.0944 0.0836 0.0951 0.0926 0.0849 0.0959 0.0798 0.0367 0.0990 0.0861 0.0870 0.0794 0.1213 0.1205 0.1165 0.1273 0.1258 0.1291 0.1270 0.1294 0.1279 0.1281
va: 2.0955 2.1519 2.1140 3.1159 3.7240 3.8099 3.8165 3.9004 3.9247 3.8799 4.2256 3.7684 3.9374 3.9408 3.8765 3.6765 4.0254 3.9194 3.9936 3.8359 3.9529 4.0332 3.8409 3.9925 3.9868 3.9617 3.9642 3.9348 1.0222 1.0288 1.0023 1.0138 1.0031 1.0057 1.0001 1.0043 1.0103 1.0037 1.0295 1.0050 0.9990 0.9988 1.0097 1.0190 1.0262 1.0200 0.9987 1.0140 1.0067 1.0032 0.9999 1.0003 0.9996
dispcorr: -0.029429086 hartree
energy: -1210.108823577797
dipole: 24.76657 -23.62052 1.14605 12.24774 -12.44742 -0.19968 -6.89818 6.20965 -0.68853
magnitude: 1.35181 au
magnitude: 3.43602 debye
