program: Orca
programVersion: 5.0.2
elementType: O O O N C C C C C C C C C C C C C C C C C C C C C C C C H H H H H H H H H H H H H H H H H H H H H H H H H
charge: 0
multiplicity: 1
keywords: wb97x-d3
keywords: def2-TZVPP
keywords: def2/J RIJCOSX
keywords: DEFGRID2
keywords: scfconv7
keywords: smallprint printgap noloewdin
keywords: NOSOSCF
formula: C24H25NO3
InChI: InChI=1/C24H25NO3/c1-16(2)13-20-22(24(20,3)4)23(26)28-21(15-25)17-9-8-12-19(14-17)27-18-10-6-5-7-11-18/h5-14,20-22H,1-4H3
53 atoms
O  -0.331019 1.307279 0.840935
O  -1.043071 3.1822 -0.16496
O  -0.034919 -3.212141 -1.214442
N  -2.042421 0.156021 3.450394
C  1.979513 3.442033 -0.98255
C  1.723776 4.294872 0.210569
C  1.294017 2.838937 0.235678
C  1.206545 3.703457 -2.251749
C  3.381901 2.938869 -1.232158
C  2.823918 4.758857 1.094677
C  -0.13987 2.510374 0.250501
C  2.765227 4.851217 2.423892
C  1.555259 4.48314 3.226603
C  3.936832 5.33817 3.221773
C  -1.653752 0.821157 0.95069
C  -1.880528 -0.376306 0.056169
C  -1.857831 0.451682 2.355764
C  -0.855855 -1.28157 -0.178824
C  -3.139535 -0.587274 -0.486547
C  -1.094052 -2.394643 -0.971237
C  -3.367838 -1.708354 -1.269373
C  -2.352372 -2.615147 -1.521176
C  -0.225347 -4.561483 -1.32283
C  -0.987806 -5.269688 -0.40216
C  0.421114 -5.218536 -2.358682
C  -1.100162 -6.645022 -0.530379
C  0.308112 -6.596233 -2.468812
C  -0.455762 -7.314187 -1.561302
H  0.892918 4.987375 0.094579
H  1.911233 2.171433 0.825436
H  1.087376 2.787746 -2.833602
H  0.218103 4.116974 -2.069822
H  1.755982 4.41604 -2.86959
H  3.359539 2.020267 -1.820352
H  3.960027 3.675731 -1.793395
H  3.921423 2.728335 -0.308939
H  3.740649 5.06543 0.59884
H  1.257323 5.313033 3.871379
H  0.697319 4.218407 2.613206
H  1.76834 3.639524 3.888066
H  4.251162 4.587236 3.950865
H  4.793675 5.573365 2.591744
H  3.68006 6.234991 3.790438
H  -2.37415 1.606017 0.699058
H  0.130073 -1.135235 0.242306
H  -3.938957 0.11967 -0.304053
H  -4.345734 -1.872892 -1.701233
H  -2.536914 -3.480053 -2.144759
H  -1.482179 -4.755383 0.412165
H  1.012653 -4.650616 -3.064637
H  -1.690912 -7.197035 0.188616
H  0.816249 -7.108366 -3.275132
H  -0.544758 -8.388116 -1.652572
totalener: -1210.08224368 hartree
nucrepener: 2408.97811907 hartree
electener: -3619.06036275 hartree
oneelecener: -6428.91370529 hartree
twoeener: 2809.85334254 hartree
kineticenergy: 1204.76534945 hartree
xcener: -118.588511686083 hartree
chargesum: -0.0000000
charge: -0.284502 -0.378521 -0.297413 -0.004253 0.129805 -0.022737 -0.134742 -0.257001 -0.271404 -0.237674 0.344615 -0.008398 -0.220653 -0.209998 0.318572 0.067300 -0.256589 -0.197772 -0.164706 0.189463 -0.110903 -0.141599 0.221614 -0.148955 -0.200431 -0.119311 -0.096277 -0.138071 0.108623 0.090752 0.088562 0.101227 0.084984 0.093388 0.091266 0.087776 0.094143 0.091489 0.079958 0.094168 0.086106 0.078822 0.088585 0.125835 0.122898 0.111937 0.129404 0.135575 0.137643 0.125639 0.129119 0.125879 0.126765
qa: -0.2845 -0.3785 -0.2974 -0.0043 0.1298 -0.0227 -0.1347 -0.2570 -0.2714 -0.2377 0.3446 -0.0084 -0.2207 -0.2100 0.3186 0.0673 -0.2566 -0.1978 -0.1647 0.1895 -0.1109 -0.1416 0.2216 -0.1490 -0.2004 -0.1193 -0.0963 -0.1381 0.1086 0.0908 0.0886 0.1012 0.0850 0.0934 0.0913 0.0878 0.0941 0.0915 0.0800 0.0942 0.0861 0.0788 0.0886 0.1258 0.1229 0.1119 0.1294 0.1356 0.1376 0.1256 0.1291 0.1259 0.1268
va: 2.0932 2.1298 2.1054 3.1209 3.7305 3.8376 3.8267 3.9051 3.9122 3.8907 4.1902 3.7412 3.9410 3.9419 3.7590 3.7455 4.0314 4.0652 4.0259 3.8982 3.9636 3.9394 3.8196 3.9410 4.0336 3.9482 3.9382 3.9557 1.0221 1.0301 1.0017 1.0196 1.0024 1.0064 1.0017 1.0042 1.0100 1.0021 1.0165 1.0012 0.9993 1.0097 0.9992 1.0411 1.0339 1.0115 1.0014 1.0025 1.0023 1.0133 0.9997 0.9990 1.0001
dispcorr: -0.024527689 hartree
energy: -1210.106771371675
dipole: 21.00115 -20.40183 0.59931 23.30472 -23.59659 -0.29187 0.10265 -1.27979 -1.17714
magnitude: 1.35279 au
magnitude: 3.43851 debye
