program: Orca
programVersion: 5.0.2
elementType: O O O N C C C C C C C C C C C C C C C C C C C C C C C C H H H H H H H H H H H H H H H H H H H H H H H H H
charge: 0
multiplicity: 1
keywords: wb97x-d3
keywords: def2-TZVPP
keywords: def2/J RIJCOSX
keywords: DEFGRID2
keywords: scfconv7
keywords: smallprint printgap noloewdin
keywords: NOSOSCF
formula: C24H25NO3
InChI: InChI=1/C24H25NO3/c1-16(2)13-20-22(24(20,3)4)23(26)28-21(15-25)17-9-8-12-19(14-17)27-18-10-6-5-7-11-18/h5-14,20-22H,1-4H3
53 atoms
O  -0.971055 2.011771 0.469846
O  0.608071 1.454019 -1.013096
O  -1.507551 -3.516781 -1.44071
N  -4.265361 1.900729 0.529344
C  2.427283 2.513467 1.372236
C  2.434076 3.473712 0.230681
C  1.110257 2.981044 0.768447
C  2.907652 1.100298 1.148138
C  2.709747 3.029712 2.763147
C  2.835731 4.893454 0.412326
C  0.278177 2.071582 -0.038291
C  2.224507 5.953016 -0.119025
C  1.01141 5.858808 -0.992539
C  2.725918 7.344472 0.125359
C  -1.870479 1.127883 -0.176515
C  -1.646309 -0.314223 0.214705
C  -3.207742 1.569009 0.228441
C  -1.62196 -1.286235 -0.768645
C  -1.484047 -0.661439 1.550864
C  -1.45665 -2.621831 -0.421256
C  -1.302869 -1.99258 1.88351
C  -1.29191 -2.981283 0.909815
C  -0.901813 -4.737033 -1.321567
C  -1.670792 -5.867137 -1.548452
C  0.455292 -4.845193 -1.046483
C  -1.072974 -7.11834 -1.509384
C  1.038191 -6.101717 -1.000229
C  0.279704 -7.241003 -1.231602
H  2.708015 3.02983 -0.723953
H  0.547739 3.673229 1.38478
H  2.759925 0.75932 0.126166
H  3.975291 1.038852 1.366262
H  2.395269 0.402024 1.812646
H  3.784143 3.04521 2.957427
H  2.331468 4.04017 2.917553
H  2.249138 2.383688 3.512105
H  3.723577 5.062928 1.015358
H  0.155843 6.354154 -0.526243
H  1.184795 6.371258 -1.941739
H  0.726031 4.834558 -1.219513
H  3.010468 7.829136 -0.811646
H  1.947705 7.967585 0.573082
H  3.59071 7.359823 0.787465
H  -1.797196 1.226269 -1.264818
H  -1.728601 -1.021233 -1.813175
H  -1.505312 0.095204 2.324098
H  -1.181372 -2.274619 2.920778
H  -1.165333 -4.017977 1.192374
H  -2.725792 -5.760416 -1.763866
H  1.050821 -3.956341 -0.880503
H  -1.671908 -8.000268 -1.693544
H  2.096246 -6.188804 -0.79153
H  0.742835 -8.217797 -1.200525
totalener: -1210.08207418 hartree
nucrepener: 2424.88878568 hartree
electener: -3634.97085985 hartree
oneelecener: -6460.72575223 hartree
twoeener: 2825.75489238 hartree
kineticenergy: 1204.76814498 hartree
xcener: -118.587955936085 hartree
chargesum: -0.0000000
charge: -0.264152 -0.366270 -0.294124 -0.002687 0.121139 -0.003943 -0.133230 -0.253760 -0.271050 -0.244817 0.320466 -0.008722 -0.222306 -0.210615 0.308194 0.062116 -0.252214 -0.169570 -0.204565 0.208420 -0.112021 -0.147310 0.214638 -0.186693 -0.155748 -0.102552 -0.116722 -0.131990 0.107953 0.095536 0.099084 0.086578 0.086442 0.090953 0.088462 0.092319 0.094127 0.091791 0.092070 0.080528 0.088894 0.085471 0.079069 0.119020 0.106528 0.125755 0.128864 0.133418 0.127334 0.137132 0.127385 0.128297 0.127075
qa: -0.2642 -0.3663 -0.2941 -0.0027 0.1211 -0.0039 -0.1332 -0.2538 -0.2710 -0.2448 0.3205 -0.0087 -0.2223 -0.2106 0.3082 0.0621 -0.2522 -0.1696 -0.2046 0.2084 -0.1120 -0.1473 0.2146 -0.1867 -0.1557 -0.1026 -0.1167 -0.1320 0.1080 0.0955 0.0991 0.0866 0.0864 0.0910 0.0885 0.0923 0.0941 0.0918 0.0921 0.0805 0.0889 0.0855 0.0791 0.1190 0.1065 0.1258 0.1289 0.1334 0.1273 0.1371 0.1274 0.1283 0.1271
va: 2.1121 2.1393 2.1093 3.1234 3.7521 3.8105 3.8303 3.9046 3.9074 3.8986 4.2149 3.7446 3.9372 3.9418 3.8401 3.6567 4.0225 4.0881 4.0175 3.9124 3.9600 3.9312 3.8278 4.0345 3.9654 3.9378 3.9407 3.9516 1.0239 1.0286 1.0184 1.0031 1.0031 1.0018 1.0053 1.0064 1.0101 1.0009 1.0024 1.0164 0.9988 0.9995 1.0097 1.0219 1.0269 1.0194 1.0006 1.0050 1.0123 1.0020 0.9991 0.9997 0.9999
dispcorr: -0.025382657 hartree
energy: -1210.107456834585
dipole: 25.67622 -24.05779 1.61843 24.07337 -24.55957 -0.48620 7.64575 -7.21921 0.42654
magnitude: 1.74288 au
magnitude: 4.43006 debye
