program: Orca
programVersion: 5.0.2
elementType: O O O N C C C C C C C C C C C C C C C C C C C C C C C C H H H H H H H H H H H H H H H H H H H H H H H H H
charge: 0
multiplicity: 1
keywords: wb97x-d3
keywords: def2-TZVPP
keywords: def2/J RIJCOSX
keywords: DEFGRID2
keywords: scfconv7
keywords: smallprint printgap noloewdin
keywords: NOSOSCF
formula: C24H25NO3
InChI: InChI=1/C24H25NO3/c1-16(2)13-20-22(24(20,3)4)23(26)28-21(15-25)17-9-8-12-19(14-17)27-18-10-6-5-7-11-18/h5-14,20-22H,1-4H3
53 atoms
O  -1.145947 1.238543 0.771847
O  -0.195746 2.068048 -1.086733
O  -1.632638 -3.630603 -0.236195
N  -4.010791 2.684902 1.617717
C  2.354197 0.821695 0.316255
C  2.382643 2.316786 0.399564
C  1.139311 1.57236 0.840222
C  2.318018 0.180176 -1.049056
C  3.103383 -0.008836 1.330594
C  3.166488 3.057269 1.404617
C  -0.093554 1.679647 0.043275
C  3.849739 4.188118 1.213479
C  3.956911 4.917711 -0.090899
C  4.584673 4.838297 2.34795
C  -2.419521 1.206486 0.162583
C  -2.923081 -0.218874 0.032925
C  -3.309474 2.030171 0.986459
C  -2.014073 -1.264053 -0.041665
C  -4.285274 -0.471544 -0.068267
C  -2.475571 -2.562413 -0.218729
C  -4.730823 -1.772578 -0.239211
C  -3.833783 -2.823755 -0.320066
C  -0.412087 -3.53501 -0.841107
C  0.679604 -4.060421 -0.166016
C  -0.262994 -2.995442 -2.113103
C  1.925934 -4.059192 -0.774515
C  0.989505 -2.995065 -2.706811
C  2.087096 -3.526893 -2.044752
H  2.267536 2.80738 -0.560289
H  0.972973 1.486722 1.908152
H  3.337551 -0.012043 -1.387989
H  1.801826 -0.781489 -1.018045
H  1.833265 0.799927 -1.799737
H  2.695015 -1.020306 1.364729
H  4.156935 -0.083377 1.056062
H  3.054744 0.398679 2.33925
H  3.170514 2.638958 2.406725
H  3.559484 5.931017 0.00198
H  5.003656 5.022246 -0.385564
H  3.433592 4.434671 -0.911923
H  5.650965 4.929039 2.126496
H  4.216275 5.852345 2.522418
H  4.482096 4.28168 3.278584
H  -2.37119 1.662517 -0.832996
H  -0.951544 -1.087044 0.056455
H  -5.003005 0.335823 0.000442
H  -5.791908 -1.969671 -0.310326
H  -4.175939 -3.841802 -0.449567
H  0.543651 -4.47844 0.822726
H  -1.116851 -2.58857 -2.639714
H  2.774647 -4.47638 -0.248854
H  1.104551 -2.578393 -3.698608
H  3.060199 -3.525651 -2.516487
totalener: -1210.08304089 hartree
nucrepener: 2515.69422521 hartree
electener: -3725.77726610 hartree
oneelecener: -6642.00525210 hartree
twoeener: 2916.22798599 hartree
kineticenergy: 1204.76285487 hartree
xcener: -118.592433800420 hartree
chargesum: -0.0000000
charge: -0.273083 -0.367841 -0.297126 -0.005889 0.100531 0.039666 -0.092591 -0.211003 -0.249275 -0.187915 0.319617 -0.053726 -0.235572 -0.201028 0.338547 0.010763 -0.250370 -0.136324 -0.196082 0.214020 -0.083270 -0.202023 0.216854 -0.202529 -0.128050 -0.088454 -0.123719 -0.150880 0.090166 0.077752 0.090479 0.030897 0.102149 0.088965 0.094293 0.075472 0.071433 0.088810 0.085708 0.082301 0.083806 0.086248 0.076527 0.128618 0.121197 0.122593 0.129200 0.128874 0.128546 0.132091 0.127639 0.127615 0.125372
qa: -0.2731 -0.3678 -0.2971 -0.0059 0.1005 0.0397 -0.0926 -0.2110 -0.2493 -0.1879 0.3196 -0.0537 -0.2356 -0.2010 0.3385 0.0108 -0.2504 -0.1363 -0.1961 0.2140 -0.0833 -0.2020 0.2169 -0.2025 -0.1281 -0.0885 -0.1237 -0.1509 0.0902 0.0778 0.0905 0.0309 0.1021 0.0890 0.0943 0.0755 0.0714 0.0888 0.0857 0.0823 0.0838 0.0862 0.0765 0.1286 0.1212 0.1226 0.1292 0.1289 0.1285 0.1321 0.1276 0.1276 0.1254
va: 2.1050 2.1409 2.1107 3.1116 3.7223 3.8177 3.8463 3.9014 3.9186 3.9142 4.2509 3.8356 3.9450 3.9338 3.7787 3.7886 4.0100 3.9362 4.0374 3.8502 3.9604 4.0412 3.8256 4.0143 3.9110 3.8949 3.9006 3.9041 1.0325 1.0388 1.0045 1.0201 1.0227 1.0054 1.0031 1.0120 1.0227 0.9990 0.9992 1.0161 0.9983 0.9984 1.0124 1.0287 1.0093 1.0191 0.9996 1.0119 1.0128 1.0042 0.9981 1.0018 1.0018
dispcorr: -0.027259373 hartree
energy: -1210.110300263378
dipole: 35.08404 -33.62834 1.45571 12.97256 -13.88281 -0.91026 1.31795 -1.85464 -0.53670
magnitude: 1.79880 au
magnitude: 4.57219 debye
