program: Orca
programVersion: 5.0.2
elementType: O O O N C C C C C C C C C C C C C C C C C C C C C C C C H H H H H H H H H H H H H H H H H H H H H H H H H
charge: 0
multiplicity: 1
keywords: wb97x-d3
keywords: def2-TZVPP
keywords: def2/J RIJCOSX
keywords: DEFGRID2
keywords: scfconv7
keywords: smallprint printgap noloewdin
keywords: NOSOSCF
formula: C24H25NO3
InChI: InChI=1/C24H25NO3/c1-16(2)13-20-22(24(20,3)4)23(26)28-21(15-25)17-9-8-12-19(14-17)27-18-10-6-5-7-11-18/h5-14,20-22H,1-4H3
53 atoms
O  -1.257838 1.867716 0.880922
O  0.016373 1.786069 -0.957727
O  -1.092997 -3.102925 -1.787503
N  -4.549357 1.878554 1.237414
C  2.301091 2.544652 1.05875
C  1.841513 3.769841 0.33472
C  0.818879 2.889347 1.011397
C  2.849387 1.38733 0.260985
C  2.952451 2.700821 2.411376
C  2.063282 5.148614 0.843512
C  -0.135027 2.130536 0.183304
C  3.213796 5.816398 0.752882
C  4.452577 5.237689 0.141337
C  3.34334 7.221445 1.257062
C  -2.268339 1.130004 0.204367
C  -2.054157 -0.356591 0.344127
C  -3.538929 1.552521 0.798935
C  -1.661432 -1.089944 -0.761478
C  -2.215315 -0.976582 1.579282
C  -1.445733 -2.459569 -0.644765
C  -1.992475 -2.336454 1.684266
C  -1.6120 -3.089658 0.580907
C  -0.686493 -4.40928 -1.7237
C  -1.543152 -5.398816 -2.177517
C  0.577888 -4.725781 -1.247737
C  -1.124493 -6.721457 -2.159173
C  0.983223 -6.051081 -1.228261
C  0.134426 -7.051708 -1.680997
H  1.843409 3.671554 -0.748423
H  0.406982 3.254516 1.945977
H  2.418587 1.313775 -0.734112
H  3.929483 1.503768 0.14877
H  2.674362 0.440044 0.774291
H  2.537715 3.531422 2.980621
H  2.831935 1.79113 3.001749
H  4.02263 2.886097 2.299469
H  1.210012 5.647556 1.293583
H  4.775091 5.833689 -0.716104
H  5.279742 5.252225 0.85539
H  4.319514 4.211956 -0.197195
H  2.415094 7.587997 1.693352
H  4.125316 7.295608 2.016809
H  3.627375 7.902664 0.451235
H  -2.294743 1.400528 -0.855673
H  -1.512949 -0.609657 -1.720164
H  -2.524222 -0.406519 2.446068
H  -2.124145 -2.830595 2.637435
H  -1.455833 -4.154609 0.686035
H  -2.523935 -5.130585 -2.547833
H  1.237995 -3.940193 -0.902922
H  -1.789629 -7.496154 -2.51676
H  1.969168 -6.301624 -0.859844
H  0.455904 -8.084348 -1.665175
totalener: -1210.08320153 hartree
nucrepener: 2406.47121197 hartree
electener: -3616.55441350 hartree
oneelecener: -6423.97156656 hartree
twoeener: 2807.41715306 hartree
kineticenergy: 1204.77152063 hartree
xcener: -118.588292492437 hartree
chargesum: 0.0000000
charge: -0.261514 -0.390151 -0.292012 -0.005968 0.063851 -0.032548 -0.100018 -0.263064 -0.245066 -0.189574 0.367795 -0.022312 -0.243139 -0.209248 0.315695 0.002691 -0.256946 -0.150613 -0.172095 0.228364 -0.130786 -0.155968 0.188287 -0.152019 -0.146341 -0.119910 -0.124153 -0.117361 0.110787 0.085023 0.104381 0.082390 0.090689 0.085609 0.098186 0.085528 0.092586 0.099096 0.088574 0.082512 0.080726 0.084346 0.086780 0.117057 0.114818 0.121589 0.129019 0.129091 0.127463 0.132250 0.128582 0.128595 0.128449
qa: -0.2615 -0.3902 -0.2920 -0.0060 0.0639 -0.0325 -0.1000 -0.2631 -0.2451 -0.1896 0.3678 -0.0223 -0.2431 -0.2092 0.3157 0.0027 -0.2569 -0.1506 -0.1721 0.2284 -0.1308 -0.1560 0.1883 -0.1520 -0.1463 -0.1199 -0.1242 -0.1174 0.1108 0.0850 0.1044 0.0824 0.0907 0.0856 0.0982 0.0855 0.0926 0.0991 0.0886 0.0825 0.0807 0.0843 0.0868 0.1171 0.1148 0.1216 0.1290 0.1291 0.1275 0.1323 0.1286 0.1286 0.1284
va: 2.1332 2.1141 2.1129 3.1205 3.7366 3.8204 3.8699 3.9067 3.9068 3.8574 4.2143 3.7400 3.9360 3.9385 3.8346 3.6863 4.0235 4.0455 4.0384 3.8975 3.9842 3.9292 3.8546 4.0135 3.9829 3.9419 3.9420 3.9369 1.0237 1.0346 1.0203 1.0025 1.0029 1.0071 1.0059 1.0021 1.0125 1.0036 0.9989 1.0102 1.0105 0.9990 0.9983 1.0214 1.0340 1.0158 1.0016 1.0099 1.0096 1.0043 0.9995 0.9997 0.9997
dispcorr: -0.025136542 hartree
energy: -1210.108338075264
dipole: 33.69258 -31.84520 1.84738 21.67964 -22.48462 -0.80498 7.93677 -7.70118 0.23559
magnitude: 2.02887 au
magnitude: 5.15697 debye
