program: Orca
programVersion: 5.0.2
elementType: O O O N C C C C C C C C C C C C C C C C C C C C C C C C H H H H H H H H H H H H H H H H H H H H H H H H H
charge: 0
multiplicity: 1
keywords: wb97x-d3
keywords: def2-TZVPP
keywords: def2/J RIJCOSX
keywords: DEFGRID2
keywords: scfconv7
keywords: smallprint printgap noloewdin
keywords: NOSOSCF
formula: C24H25NO3
InChI: InChI=1/C24H25NO3/c1-16(2)13-20-22(24(20,3)4)23(26)28-21(15-25)17-9-8-12-19(14-17)27-18-10-6-5-7-11-18/h5-14,20-22H,1-4H3
53 atoms
O  -0.840065 1.800068 0.672798
O  0.47543 1.872186 -1.140652
O  -0.183159 -3.153396 -1.522984
N  -4.139603 2.108509 0.741165
C  2.708023 2.166644 1.051679
C  2.443999 3.491618 0.421814
C  1.279453 2.688497 0.960795
C  3.163009 1.018886 0.183745
C  3.280126 2.122786 2.448546
C  2.85249 4.758473 1.082594
C  0.309016 2.089754 0.029868
C  2.121519 5.870482 1.170288
C  0.742993 6.006144 0.600502
C  2.648363 7.092185 1.860648
C  -1.854932 1.136918 -0.073563
C  -1.766904 -0.355981 0.130112
C  -3.130123 1.685487 0.393027
C  -1.061982 -1.114278 -0.793301
C  -2.333891 -0.960799 1.245288
C  -0.919617 -2.482342 -0.599026
C  -2.187242 -2.325188 1.426091
C  -1.481331 -3.094715 0.514629
C  -0.409468 -4.487132 -1.726973
C  0.66266 -5.357052 -1.61153
C  -1.666467 -4.954182 -2.089025
C  0.474268 -6.708141 -1.86485
C  -1.843447 -6.306931 -2.330431
C  -0.777177 -7.18852 -2.2183
H  2.507284 3.49063 -0.664188
H  0.853685 3.022386 1.89986
H  2.795705 1.086044 -0.837052
H  4.253735 1.006432 0.142202
H  2.838605 0.061714 0.59608
H  3.004425 1.190947 2.944523
H  4.370593 2.17118 2.418741
H  2.92985 2.947094 3.069288
H  3.852238 4.769542 1.508165
H  0.011369 6.195786 1.389958
H  0.69411 6.861619 -0.077264
H  0.420372 5.128459 0.046026
H  1.991559 7.391948 2.680976
H  3.645737 6.935282 2.269457
H  2.695506 7.941533 1.17489
H  -1.761759 1.373537 -1.137608
H  -0.611666 -0.650776 -1.661995
H  -2.893815 -0.37727 1.964509
H  -2.626412 -2.80199 2.291971
H  -1.372229 -4.15917 0.674627
H  1.63509 -4.973408 -1.332274
H  -2.496892 -4.266171 -2.185244
H  1.311863 -7.387425 -1.778366
H  -2.821396 -6.67205 -2.614762
H  -0.921369 -8.243008 -2.410296
totalener: -1210.08329046 hartree
nucrepener: 2423.87232434 hartree
electener: -3633.95561480 hartree
oneelecener: -6458.74772770 hartree
twoeener: 2824.79211289 hartree
kineticenergy: 1204.77032794 hartree
xcener: -118.589179607705 hartree
chargesum: -0.0000000
charge: -0.255518 -0.388547 -0.294197 -0.006674 0.119692 -0.002715 -0.149306 -0.262989 -0.270003 -0.243740 0.367232 -0.008841 -0.222570 -0.209429 0.310869 0.008762 -0.254623 -0.170715 -0.165266 0.197528 -0.120250 -0.146306 0.209740 -0.184314 -0.147380 -0.105083 -0.120138 -0.129775 0.107940 0.094672 0.101508 0.086144 0.089381 0.094190 0.090186 0.087961 0.093868 0.091785 0.092154 0.082953 0.085375 0.078752 0.088304 0.121448 0.127444 0.120642 0.129894 0.134052 0.126853 0.135366 0.127114 0.128959 0.127611
qa: -0.2555 -0.3885 -0.2942 -0.0067 0.1197 -0.0027 -0.1493 -0.2630 -0.2700 -0.2437 0.3672 -0.0088 -0.2226 -0.2094 0.3109 0.0088 -0.2546 -0.1707 -0.1653 0.1975 -0.1202 -0.1463 0.2097 -0.1843 -0.1474 -0.1051 -0.1201 -0.1298 0.1079 0.0947 0.1015 0.0861 0.0894 0.0942 0.0902 0.0880 0.0939 0.0918 0.0922 0.0830 0.0854 0.0788 0.0883 0.1214 0.1274 0.1206 0.1299 0.1341 0.1269 0.1354 0.1271 0.1290 0.1276
va: 2.1160 2.1125 2.1071 3.1187 3.7413 3.8042 3.8632 3.9067 3.9078 3.8932 4.1713 3.7469 3.9372 3.9416 3.8148 3.7310 4.0293 3.9970 4.0396 3.8971 3.9753 3.9346 3.8324 4.0298 3.9593 3.9383 3.9446 3.9489 1.0228 1.0292 1.0189 1.0029 1.0015 1.0058 1.0019 1.0053 1.0104 1.0012 1.0021 1.0153 0.9996 1.0098 0.9990 1.0243 1.0327 1.0181 1.0014 1.0045 1.0121 1.0021 0.9991 0.9997 0.9998
dispcorr: -0.025140351 hartree
energy: -1210.108430814843
dipole: 22.97111 -21.79273 1.17837 20.85535 -21.76092 -0.90557 10.23527 -9.84800 0.38727
magnitude: 1.53577 au
magnitude: 3.90362 debye
