program: Orca
programVersion: 5.0.2
elementType: O O O N C C C C C C C C C C C C C C C C C C C C C C C C H H H H H H H H H H H H H H H H H H H H H H H H H
charge: 0
multiplicity: 1
keywords: wb97x-d3
keywords: def2-TZVPP
keywords: def2/J RIJCOSX
keywords: DEFGRID2
keywords: scfconv7
keywords: smallprint printgap noloewdin
keywords: NOSOSCF
formula: C24H25NO3
InChI: InChI=1/C24H25NO3/c1-16(2)13-20-22(24(20,3)4)23(26)28-21(15-25)17-9-8-12-19(14-17)27-18-10-6-5-7-11-18/h5-14,20-22H,1-4H3
53 atoms
O  -0.521975 1.162098 1.554685
O  -0.77808 2.625151 -0.119969
O  -1.01211 -3.760674 -0.008199
N  -2.672686 -0.020184 3.777399
C  2.344257 2.443426 -0.277242
C  1.978878 3.65571 0.52175
C  1.374809 2.308654 0.88406
C  1.857244 2.356551 -1.703725
C  3.691467 1.788047 -0.083107
C  2.902649 4.305548 1.468371
C  -0.066724 2.084072 0.682754
C  3.015883 5.613009 1.714882
C  2.202576 6.686867 1.059111
C  4.013581 6.1170 2.715475
C  -1.882809 0.773811 1.417189
C  -2.033357 -0.32089 0.389434
C  -2.309665 0.328445 2.745278
C  -1.455814 -1.560877 0.621532
C  -2.70573 -0.071247 -0.797915
C  -1.565335 -2.563113 -0.331266
C  -2.815039 -1.081843 -1.740159
C  -2.253786 -2.328682 -1.517454
C  -0.694126 -4.662488 -0.98541
C  0.173967 -4.333043 -2.018619
C  -1.218154 -5.941335 -0.882251
C  0.509936 -5.297574 -2.955237
C  -0.866192 -6.900412 -1.820681
C  -0.007453 -6.582227 -2.861472
H  1.280729 4.312994 0.015619
H  1.779561 1.824927 1.765858
H  0.924632 2.888823 -1.869893
H  2.609578 2.786305 -2.367623
H  1.707994 1.317567 -2.00376
H  4.015819 1.771421 0.956441
H  3.661007 0.753902 -0.430193
H  4.456771 2.311327 -0.658816
H  3.554156 3.639889 2.026769
H  2.851559 7.396972 0.540639
H  1.480268 6.314785 0.33637
H  1.652175 7.26114 1.808376
H  4.589742 5.309516 3.165459
H  4.717225 6.813469 2.252643
H  3.518739 6.664923 3.521285
H  -2.502808 1.631046 1.137476
H  -0.929185 -1.767003 1.545765
H  -3.132218 0.904178 -0.988507
H  -3.347034 -0.900325 -2.664361
H  -2.359257 -3.108633 -2.2597
H  0.587234 -3.334652 -2.08678
H  -1.888294 -6.179527 -0.066786
H  1.187848 -5.043556 -3.759296
H  -1.271794 -7.900041 -1.737596
H  0.262039 -7.331658 -3.59314
totalener: -1210.08388625 hartree
nucrepener: 2409.05306819 hartree
electener: -3619.13695444 hartree
oneelecener: -6429.02942734 hartree
twoeener: 2809.89247290 hartree
kineticenergy: 1204.76623236 hartree
xcener: -118.589119632909 hartree
chargesum: -0.0000000
charge: -0.264859 -0.387699 -0.291402 -0.003281 0.078316 0.038961 -0.091446 -0.252357 -0.252676 -0.182419 0.354750 -0.052845 -0.236525 -0.201565 0.335116 0.004334 -0.265344 -0.204629 -0.124885 0.218650 -0.118851 -0.159694 0.224560 -0.168532 -0.185610 -0.114991 -0.102052 -0.132651 0.090270 0.076759 0.099776 0.087840 0.085458 0.074727 0.091488 0.095101 0.071674 0.086653 0.082741 0.087992 0.076805 0.084099 0.085815 0.116186 0.121124 0.116217 0.129209 0.133638 0.134490 0.128460 0.127965 0.127761 0.127379
qa: -0.2649 -0.3877 -0.2914 -0.0033 0.0783 0.0390 -0.0914 -0.2524 -0.2527 -0.1824 0.3548 -0.0528 -0.2365 -0.2016 0.3351 0.0043 -0.2653 -0.2046 -0.1249 0.2187 -0.1189 -0.1597 0.2246 -0.1685 -0.1856 -0.1150 -0.1021 -0.1327 0.0903 0.0768 0.0998 0.0878 0.0855 0.0747 0.0915 0.0951 0.0717 0.0867 0.0827 0.0880 0.0768 0.0841 0.0858 0.1162 0.1211 0.1162 0.1292 0.1336 0.1345 0.1285 0.1280 0.1278 0.1274
va: 2.1319 2.1172 2.1149 3.1203 3.7399 3.8060 3.8645 3.9125 3.9183 3.9112 4.2226 3.8315 3.9435 3.9333 3.8225 3.6916 4.0328 4.0930 3.9875 3.8902 3.9775 3.9331 3.8180 3.9667 4.0368 3.9403 3.9357 3.9524 1.0293 1.0373 1.0216 1.0006 1.0029 1.0112 1.0041 1.0028 1.0226 0.9990 1.0160 0.9990 1.0124 0.9982 0.9986 1.0213 1.0298 1.0188 1.0013 1.0052 1.0026 1.0121 0.9997 0.9990 1.0000
dispcorr: -0.024025539 hartree
energy: -1210.107911788599
dipole: 27.19201 -26.12165 1.07036 27.18203 -27.12369 0.05833 -6.61331 4.96823 -1.64508
magnitude: 1.96351 au
magnitude: 4.99084 debye
